{"text_format":"1","workbook":"xlsx","n_sheets":8,"sheets":["Intro and Data Inputs","GASB Results","Additional Disclosures","Certification Letter","Inactive","Log","Lookups","Trends"],"not_rendered":{"charts":0,"images":2,"macros":1,"external_links":0,"defined_names":27,"comments":3,"pivot_tables":0},"unopened":[],"bounds":{"document_bytes":16777216,"sheet_cells":100000,"rows_first":2000,"rows_last":500,"rows_between":2000,"halvings":0,"cell_chars":16384,"cell_head_chars":4096},"cells_cut":0,"cells_raw":0,"read":"whole","date_system":"1900"}

{"sheet":"Intro and Data Inputs","index":0,"n_rows":37,"n_cols":9,"rows_kept":37,"cut":false,"hidden":false,"merged":[[37,1,37,8],[13,2,13,7],[14,2,14,7],[15,2,15,7],[16,2,16,7],[17,2,17,7],[26,2,26,3],[27,2,27,3],[29,2,29,6],[32,2,32,7],[28,2,28,6],[31,2,31,7],[0,1,0,8],[2,1,2,8],[21,2,21,6],[22,2,22,6],[7,2,7,7],[8,2,8,7],[9,2,9,7],[12,2,12,7],[4,2,4,7],[5,2,5,7],[10,2,10,7],[1,2,1,7],[6,2,6,7],[11,2,11,7],[18,2,18,7],[3,2,3,7],[35,2,35,7],[34,2,34,7],[33,2,33,7],[19,2,20,7],[30,2,30,7]]}
[null,"GASB 75 Alternative Measurement Method for LEOFF 1"]
[]
[null,"Welcome to the Office of the State Actuary's (OSA) AMM Online Tool"]
[null,null,"Intended Use"]
[null,null,"This Alternative Measurement Method (AMM) Online Tool is intended to assist local government employers in Washington State covering Law Enforcement Officers' and Fire Fighters' Retirement System (LEOFF) Plan 1 retiree healthcare costs with their reporting requirements for Other Postemployment Benefits (OPEB) healthcare obligations under Governmental Accounting Standards Board (GASB) Statement No. 75.\nPlease review the following explanation and directions below, along with the Additional Disclosures and Certification Letter before proceeding."]
[]
[null,null,"Requirements to use this Tool"]
[null,null,"(1) Employers must be local government entities in Washington State. Employers outside the State of \n      Washington are not eligible to use this Tool."]
{"$rows_left_out":30}
{"sheet":"GASB Results","index":1,"n_rows":59,"n_cols":8,"rows_kept":59,"cut":false,"hidden":false,"merged":[[60,1,60,7],[59,1,59,7],[45,4,45,5],[40,4,40,5],[41,4,41,5],[42,4,42,5],[43,4,43,5],[44,4,44,5],[46,4,46,5],[47,4,47,5],[53,4,53,5],[52,4,52,5],[51,4,51,5],[49,4,49,5],[54,2,54,5],[56,2,56,5],[23,5,23,6],[33,2,33,6],[0,1,0,7],[2,2,2,4],[3,2,3,4],[4,2,4,3],[5,2,5,3],[1,2,1,4],[1,5,1,6],[2,5,2,6],[3,5,3,6],[11,2,11,3],[4,5,4,6],[5,5,6,6],[9,5,10,6],[11,5,13,6],[7,5,8,6],[6,2,6,3],[7,2,7,3],[8,2,8,3],[9,2,9,3],[10,2,10,3],[14,2,14,3],[19,5,19,6],[20,5,20,6],[21,5,21,6],[22,5,22,6],[16,2,16,3],[17,2,17,3],[19,2,19,4],[13,2,13,3],[18,2,18,4],[18,5,18,6],[14,5,17,6],[24,5,24,6],[25,5,25,6],[26,2,26,4],[26,5,26,6],[28,2,28,4],[50,4,50,5],[55,2,55,5],[39,4,39,5],[29,2,29,6],[34,4,34,5],[35,4,35,5],[36,4,36,5],[37,4,37,5],[38,4,38,5]]}
[null,"LEOFF 1 - GASB 75 Reporting Results and Required Disclosures"]
[]
[null,null,"Schedule of Changes in Total OPEB Liability and Related Ratios"]
[null,null,{"$f":"\"Measurement Date of June 30, \"&Lookups!L17","v":"Measurement Date of June 30, 2020"}]
[null,null,"Total OPEB Liability (TOL)",null,null,"What's New in this FY20 Tool?"]
[null,null,"Service Cost1",null,{"$f":"IF('Intro and Data Inputs'!E28>0, ROUND(Log!L5,0) * 'Intro and Data Inputs'!E28/Log!L6, ROUND(Log!L5,0))","v":0},"And how do these changes impact \nmy resulting OPEB liabilities? ↑or↓"]
[null,null,"Interest Cost",null,{"$f":"ROUND(((E6+E14)*Lookups!L1+E10*((1+Lookups!L1)^0.5-1)),0)","v":0}]
[null,null,"Changes in Experience Data and Assumptions",null,{"$f":"E12-E6-E7-E10","v":0},"- New discount rate as of\n  June 30th, 2020. ↑"]
{"$rows_left_out":52}
{"sheet":"Additional Disclosures","index":2,"n_rows":41,"n_cols":4,"rows_kept":41,"cut":false,"hidden":false,"merged":[[41,1,41,3],[0,1,0,3]]}
[null,"LEOFF 1 - AMM Online Tool Additional Disclosures"]
[]
[null,null,"This tab is intended to:"]
[null,null,"(1) Provide guidance on concepts that require users to apply their judgment and/or consult with their auditor."]
[null,null,"(2) Document the assumptions and methods we employed for purposes of this AMM Online Tool that vary\n     from the underlying actuarial valuation we performed at the plan-level."]
[]
[null,null,"Data Inputs:"]
[]
{"$rows_left_out":34}
{"sheet":"Certification Letter","index":3,"n_rows":119,"n_cols":4,"rows_kept":119,"cut":false,"hidden":false,"merged":[[0,1,0,3],[59,1,59,3],[60,1,60,3],[119,1,119,3]]}
[null,"LEOFF 1 - GASB 75 AMM Online Tool Actuarial Certification"]
[]
[]
[]
[]
[]
[]
[]
{"$rows_left_out":112}
{"sheet":"Inactive","index":4,"n_rows":101,"n_cols":43,"rows_kept":101,"cut":false,"hidden":true,"merged":[[0,19,0,21],[0,9,0,10],[0,11,0,12],[0,13,0,14],[0,16,0,18]]}
["Inactives",0,null,"Medical","Medicare",null,"LTC - Inst.","LTC - Non Inst.",null,"Medical - Age<65",null,"Medical - Age>=65",null,"Medicare ",null,null,"LTC - Inst.",null,null,"LTC - Non Inst.",null,null,null,"Medical","Medicare",null,null,"LTC - Inst.","LTC - Non Inst.",null,null,null,null,null,"Pct Male",1,null,null,null,null,null,"PV of "]
["Year",null,null,"Cost","Cost",null,"Cost","Cost",null,"Trend","Rel Trend","Trend","Rel Trend","Trend","Rel Trend",null,"Rate","Trend","Rel Trend","Rate","Trend","Rel Trend",null,"Net Cost","Net Cost","Total",null,"Net Cost","Net Cost","Total",null,"Grand Total",null,"Mort - M","Mort - F","Mortality","Survive","Interest","Pay Timing",null,null,"Benefits"]
[{"$f":"ToolYear","v":2020},78,null,{"$f":"VLOOKUP(B3,Lookups!A:B,2)","v":15426.482227200002},{"$f":"VLOOKUP(B3,Lookups!A:C,3)","v":1737.0169740000001},null,{"$f":"VLOOKUP(B3,Lookups!A:D,4)","v":200823.11357349996},{"$f":"VLOOKUP(B3,Lookups!A:E,5)","v":155529.65566709999},null,{"$f":"VLOOKUP(A3,Trends!$A$3:$H$94,IF(ExFlg=0,4,2))+Sens","v":1.054},1,{"$f":"VLOOKUP(A3,Trends!$A$3:$H$94,IF(ExFlg=0,5,3))+Sens","v":1.0529999999999999},1,{"$f":"VLOOKUP(A3,Trends!$A$3:$H$94,6)+Sens","v":1.046},1,null,{"$f":"IF(B3<=120,VLOOKUP(B3,Lookups!$A$3:$I$103,8,FALSE),\"\")","v":1.6920000000000001E-2},{"$f":"VLOOKUP(A3,Trends!$A$3:$H$94,7)+Sens","v":1.0449999999999999},1,{"$f":"IF(B3<=120,VLOOKUP(B3,Lookups!$A$3:$I$103,9,FALSE),\"\")","v":2.7720000000000002E-2},{"$f":"VLOOKUP(A3,Trends!$A$3:$H$94,8)+Sens","v":1.0449999999999999},1,null,{"$f":"IF(B3<=120,IF(B3<65,D3*K3,D3*M3),\"\")","v":15426.482227200002},{"$f":"IF(B3<=120,E3*O3,\"\")","v":1737.0169740000001},{"$f":"IF(B3<=120,X3+Y3,\"\")","v":17163.4992012},null,{"$f":"IF(B3<=120,G3*Q3*S3,\"\")","v":3397.9270816636194},{"$f":"IF(B3<=120,H3*T3*V3,\"\")","v":4311.2820550920114},{"$f":"IF(B3<=120,AB3+AC3,\"\")","v":7709.2091367556313},null,{"$f":"IF(B3<=120,Z3+AD3, \"\")","v":24872.708337955632},null,{"$f":"IF($B3<121,VLOOKUP($B3,Lookups!A:F,6)*(1-VLOOKUP($B3,Lookups!$N$3:$P$103,2))^($A3-$A$3),\"\")","v":4.11234717375E-2},{"$f":"IF($B3<121,VLOOKUP($B3,Lookups!A:G,7)*(1-VLOOKUP($B3,Lookups!$N$3:$P$103,3))^($A3-$A$3),\"\")","v":3.4319758823999999E-2},{"$f":"IF(B3<121,(PCTMALE*AH3+(1-PCTMALE)*AI3),\"\")","v":4.11234717375E-2},1,1,{"$f":"IF(AJ3=\"\",\"\",ROUND((13/24)+(11/24)*(1/(1+IntRt))*(1-AJ3),6))","v":0.96628999999999998},null,null,{"$f":"IF(B3<=120,AF3*AK3*AL3*AM3,\"\")","v":24034.249339883147}]
[{"$f":"1+A3","v":2021},{"$f":"1+B3","v":79},null,{"$f":"VLOOKUP(B4,Lookups!A:B,2)","v":15456.839270400002},{"$f":"VLOOKUP(B4,Lookups!A:C,3)","v":1737.0169740000001},null,{"$f":"VLOOKUP(B4,Lookups!A:D,4)","v":201599.53242824995},{"$f":"VLOOKUP(B4,Lookups!A:E,5)","v":155914.45688444996},null,{"$f":"VLOOKUP(A4,Trends!$A$3:$H$94,IF(ExFlg=0,4,2))+Sens","v":1.0509999999999999},{"$f":"K3*J3","v":1.054},{"$f":"VLOOKUP(A4,Trends!$A$3:$H$94,IF(ExFlg=0,5,3))+Sens","v":1.0509999999999999},{"$f":"M3*L3","v":1.0529999999999999},{"$f":"VLOOKUP(A4,Trends!$A$3:$H$94,6)+Sens","v":1.0489999999999999},{"$f":"O3*N3","v":1.046},null,{"$f":"IF(B4<=120,VLOOKUP(B4,Lookups!$A$3:$I$103,8,FALSE),\"\")","v":2.0039999999999999E-2},{"$f":"VLOOKUP(A4,Trends!$A$3:$H$94,7)+Sens","v":1.0449999999999999},{"$f":"S3*R3","v":1.0449999999999999},{"$f":"IF(B4<=120,VLOOKUP(B4,Lookups!$A$3:$I$103,9,FALSE),\"\")","v":3.0440000000000002E-2},{"$f":"VLOOKUP(A4,Trends!$A$3:$H$94,8)+Sens","v":1.0449999999999999},{"$f":"V3*U3","v":1.0449999999999999},null,{"$f":"IF(B4<=120,IF(B4<65,D4*K4,D4*M4),\"\")","v":16276.0517517312},{"$f":"IF(B4<=120,E4*O4,\"\")","v":1816.9197548040001},{"$f":"IF(B4<=120,X4+Y4,\"\")","v":18092.971506535199},null,{"$f":"IF(B4<=120,G4*Q4*S4,\"\")","v":4221.8570882059248},{"$f":"IF(B4<=120,H4*T4*V4,\"\")","v":4959.6076906029766},{"$f":"IF(B4<=120,AB4+AC4,\"\")","v":9181.4647788089023},null,{"$f":"IF(B4<=120,Z4+AD4, \"\")","v":27274.436285344102},null,{"$f":"IF($B4<121,VLOOKUP($B4,Lookups!A:F,6)*(1-VLOOKUP($B4,Lookups!$N$3:$P$103,2))^($A4-$A$3),\"\")","v":4.5198489504375008E-2},{"$f":"IF($B4<121,VLOOKUP($B4,Lookups!A:G,7)*(1-VLOOKUP($B4,Lookups!$N$3:$P$103,3))^($A4-$A$3),\"\")","v":3.7506693278079997E-2},{"$f":"IF(B4<121,(PCTMALE*AH4+(1-PCTMALE)*AI4),\"\")","v":4.5198489504375008E-2},{"$f":"IF(B4<121,AK3*(1-AJ3),\"\")","v":0.95887652826250003},{"$f":"IF(B4<121,AL3/(1+IntRt),\"\")","v":0.96618357487922713},{"$f":"IF(AJ4=\"\",\"\",ROUND((13/24)+(11/24)*(1/(1+IntRt))*(1-AJ4),6))","v":0.96448500000000004},null,null,{"$f":"IF(B4<=120,AF4*AK4*AL4*AM4,\"\")","v":24371.013997895468}]
[2022,80,null,{"$f":"VLOOKUP(B5,Lookups!A:B,2)","v":15487.330636800003},{"$f":"VLOOKUP(B5,Lookups!A:C,3)","v":1737.0169740000001},null,{"$f":"VLOOKUP(B5,Lookups!A:D,4)","v":202375.95128299997},{"$f":"VLOOKUP(B5,Lookups!A:E,5)","v":156299.25810179999},null,{"$f":"VLOOKUP(A5,Trends!$A$3:$H$94,IF(ExFlg=0,4,2))+Sens","v":1.0509999999999999},{"$f":"K4*J4","v":1.1077539999999999},{"$f":"VLOOKUP(A5,Trends!$A$3:$H$94,IF(ExFlg=0,5,3))+Sens","v":1.0509999999999999},{"$f":"M4*L4","v":1.1067029999999998},{"$f":"VLOOKUP(A5,Trends!$A$3:$H$94,6)+Sens","v":1.0589999999999999},{"$f":"O4*N4","v":1.097254},null,{"$f":"IF(B5<=120,VLOOKUP(B5,Lookups!$A$3:$I$103,8,FALSE),\"\")","v":2.316E-2},{"$f":"VLOOKUP(A5,Trends!$A$3:$H$94,7)+Sens","v":1.0449999999999999},{"$f":"S4*R4","v":1.0920249999999998},{"$f":"IF(B5<=120,VLOOKUP(B5,Lookups!$A$3:$I$103,9,FALSE),\"\")","v":3.3160000000000002E-2},{"$f":"VLOOKUP(A5,Trends!$A$3:$H$94,8)+Sens","v":1.0449999999999999},{"$f":"V4*U4","v":1.0920249999999998},null,17139.875277738469,1905.948822789396,19045.824100527865,null,5118.3506943077855,5659.8382434169771,10778.188937724763,null,29824.013038252626,null,{"$f":"IF($B5<121,VLOOKUP($B5,Lookups!A:F,6)*(1-VLOOKUP($B5,Lookups!$N$3:$P$103,2))^($A5-$A$3),\"\")","v":4.9630086958601882E-2},{"$f":"IF($B5<121,VLOOKUP($B5,Lookups!A:G,7)*(1-VLOOKUP($B5,Lookups!$N$3:$P$103,3))^($A5-$A$3),\"\")","v":4.1049560672901247E-2},4.9630086958601882E-2,{"$f":"IF(B5<121,AK4*(1-AJ4),\"\")","v":0.9155367575638359},0.93351070036640305,0.96252300000000002,null,null,24534.221523798435]
[2023,81,null,{"$f":"VLOOKUP(B6,Lookups!A:B,2)","v":15517.822003200001},{"$f":"VLOOKUP(B6,Lookups!A:C,3)","v":1737.0169740000001},null,{"$f":"VLOOKUP(B6,Lookups!A:D,4)","v":203152.37013774997},{"$f":"VLOOKUP(B6,Lookups!A:E,5)","v":156684.05931914996},null,{"$f":"VLOOKUP(A6,Trends!$A$3:$H$94,IF(ExFlg=0,4,2))+Sens","v":1.0509999999999999},{"$f":"K5*J5","v":1.1642494539999999},{"$f":"VLOOKUP(A6,Trends!$A$3:$H$94,IF(ExFlg=0,5,3))+Sens","v":1.0509999999999999},1.1631448529999997,{"$f":"VLOOKUP(A6,Trends!$A$3:$H$94,6)+Sens","v":1.0569999999999999},1.1619919859999999,null,{"$f":"IF(B6<=120,VLOOKUP(B6,Lookups!$A$3:$I$103,8,FALSE),\"\")","v":2.6279999999999998E-2},{"$f":"VLOOKUP(A6,Trends!$A$3:$H$94,7)+Sens","v":1.0449999999999999},1.1411661249999998,{"$f":"IF(B6<=120,VLOOKUP(B6,Lookups!$A$3:$I$103,9,FALSE),\"\")","v":3.5880000000000002E-2},{"$f":"VLOOKUP(A6,Trends!$A$3:$H$94,8)+Sens","v":1.0449999999999999},1.1411661249999998,null,18049.474792792225,2018.3998033339703,20067.874596126196,null,6092.5082472253116,6415.4351647114618,12507.943411936772,null,32575.818008062968,null,{"$f":"IF($B6<121,VLOOKUP($B6,Lookups!A:F,6)*(1-VLOOKUP($B6,Lookups!$N$3:$P$103,2))^($A6-$A$3),\"\")","v":5.442111817334562E-2},{"$f":"IF($B6<121,VLOOKUP($B6,Lookups!A:G,7)*(1-VLOOKUP($B6,Lookups!$N$3:$P$103,3))^($A6-$A$3),\"\")","v":4.4998598825774686E-2},5.442111817334562E-2,0.87009858867214629,0.90194270566802237,0.96040099999999995,null,null,24552.479012023476]
[2024,82,null,{"$f":"VLOOKUP(B7,Lookups!A:B,2)","v":15548.447692800002},{"$f":"VLOOKUP(B7,Lookups!A:C,3)","v":1737.0169740000001},null,{"$f":"VLOOKUP(B7,Lookups!A:D,4)","v":203928.78899249993},{"$f":"VLOOKUP(B7,Lookups!A:E,5)","v":157068.86053649997},null,{"$f":"VLOOKUP(A7,Trends!$A$3:$H$94,IF(ExFlg=0,4,2))+Sens","v":1.0509999999999999},1.2236261761539999,{"$f":"VLOOKUP(A7,Trends!$A$3:$H$94,IF(ExFlg=0,5,3))+Sens","v":1.0509999999999999},1.2224652405029997,{"$f":"VLOOKUP(A7,Trends!$A$3:$H$94,6)+Sens","v":1.05},{"$f":"O6*N6","v":1.2282255292019997},null,{"$f":"IF(B7<=120,VLOOKUP(B7,Lookups!$A$3:$I$103,8,FALSE),\"\")","v":2.9399999999999999E-2},{"$f":"VLOOKUP(A7,Trends!$A$3:$H$94,7)+Sens","v":1.0449999999999999},1.1925186006249997,{"$f":"IF(B7<=120,VLOOKUP(B7,Lookups!$A$3:$I$103,9,FALSE),\"\")","v":3.8600000000000002E-2},{"$f":"VLOOKUP(A7,Trends!$A$3:$H$94,8)+Sens","v":1.0449999999999999},1.1925186006249997,null,19007.436848227066,2133.4485921240062,21140.88544035107,null,7149.7528978487144,7230.0709578737578,14379.823855722472,null,35520.709296073546,null,{"$f":"IF($B7<121,VLOOKUP($B7,Lookups!A:F,6)*(1-VLOOKUP($B7,Lookups!$N$3:$P$103,2))^($A7-$A$3),\"\")","v":5.9774198662123045E-2},{"$f":"IF($B7<121,VLOOKUP($B7,Lookups!A:G,7)*(1-VLOOKUP($B7,Lookups!$N$3:$P$103,3))^($A7-$A$3),\"\")","v":4.9406884627471358E-2},5.9774198662123045E-2,0.82274685055555818,0.87144222769857238,0.95803099999999997,null,null,24398.662577724568]
[2025,83,null,{"$f":"VLOOKUP(B8,Lookups!A:B,2)","v":15415.199078400001},{"$f":"VLOOKUP(B8,Lookups!A:C,3)","v":1737.0169740000001},null,{"$f":"VLOOKUP(B8,Lookups!A:D,4)","v":202169.96260724997},{"$f":"VLOOKUP(B8,Lookups!A:E,5)","v":156031.06331394997},null,{"$f":"VLOOKUP(A8,Trends!$A$3:$H$94,IF(ExFlg=0,4,2))+Sens","v":1.0509999999999999},1.286031111137854,{"$f":"VLOOKUP(A8,Trends!$A$3:$H$94,IF(ExFlg=0,5,3))+Sens","v":1.0509999999999999},1.2848109677686526,{"$f":"VLOOKUP(A8,Trends!$A$3:$H$94,6)+Sens","v":1.054},1.2896368056620997,null,{"$f":"IF(B8<=120,VLOOKUP(B8,Lookups!$A$3:$I$103,8,FALSE),\"\")","v":3.4979999999999997E-2},{"$f":"VLOOKUP(A8,Trends!$A$3:$H$94,7)+Sens","v":1.0449999999999999},1.2461819376531247,{"$f":"IF(B8<=120,VLOOKUP(B8,Lookups!$A$3:$I$103,9,FALSE),\"\")","v":4.3240000000000001E-2},{"$f":"VLOOKUP(A8,Trends!$A$3:$H$94,8)+Sens","v":1.0449999999999999},1.2461819376531247,null,19805.616846265548,2240.1210217302068,22045.737867995755,null,8812.8806396859436,8407.7193333057057,17220.599972991651,null,39266.337840987406,null,{"$f":"IF($B8<121,VLOOKUP($B8,Lookups!A:F,6)*(1-VLOOKUP($B8,Lookups!$N$3:$P$103,2))^($A8-$A$3),\"\")","v":6.5533340138701573E-2},{"$f":"IF($B8<121,VLOOKUP($B8,Lookups!A:G,7)*(1-VLOOKUP($B8,Lookups!$N$3:$P$103,3))^($A8-$A$3),\"\")","v":5.4337896061920174E-2},6.5533340138701573E-2,0.77356781686181419,0.84197316685852408,0.95548,null,null,24436.479818067233]
{"$rows_left_out":94}
{"sheet":"Log","index":5,"n_rows":32,"n_cols":12,"rows_kept":32,"cut":false,"hidden":true,"merged":[[0,1,0,4],[0,6,0,9]]}
["EoP = End of Period","Actives Cohort",null,null,null,null,"Inactive Cohorts"]
["BoP = Beginning of Period","1","2","3","4",null,"1","2","3","4"]
[null,null,null,null,null,null,"55-64","65-69","70-74","75+",null,"Total"]
["Run 1 - EoP Data, BoP Discount Rate, New HC Assumptions"]
["Service Cost (EANC)",null,null,null,null,null,null,null,null,null,null,{"$f":"SUM(B5:E5)","v":0}]
["Total OPEB Liability (TOL)",null,null,null,null,null,0,0,0,0,null,{"$f":"SUM(B6:E6,G6:J6)","v":0}]
["Expected Benefit Payments ",null,null,null,null,null,0,0,0,0,null,{"$f":"SUM(B7:E7,G7:J7)","v":0}]
[]
{"$rows_left_out":25}
{"sheet":"Lookups","index":6,"n_rows":103,"n_cols":26,"rows_kept":103,"cut":false,"hidden":true,"merged":[[0,7,1,7],[0,8,1,8],[0,14,0,15]]}
[null,"Medical","Medicare ","LTC Inst.","LTC Non-","Mortality","Mortality","Institutional\nLTC Rate","Non-Inst.\nLTC Rate",null,{"$f":"ToolYear - 1 & \" Discount\"","v":"2019 Discount"},3.5000000000000003E-2,null,null,"100% Scale BB",null,null,"Medical","Medicare ","LTC Inst.","LTC Non-",null,"Mortality","Mortality"]
["Age","Cost","Cost","Cost","Inst. Cost","Male","Female",null,null,null,{"$f":"ToolYear & \" Discount\"","v":"2020 Discount"},2.2100000000000002E-2,null,"Age","Male","Female",null,"Cost","Cost","Cost","Inst. Cost",null,"Male","Female"]
[20,{"$f":"R3*IF(ValYear=ToolYear,1,IF(ValYear = ToolYear-1, VLOOKUP(ToolYear-1,Trends!$A$3:$H$94,IF(ExFlg=1,2,4)), VLOOKUP(ToolYear-1,Trends!$A$3:$H$94,IF(ExFlg=1,2,4)) * VLOOKUP(ToolYear-2,Trends!$A$3:$H$94,IF(ExFlg=1,2,4))))","v":43474.138196159998},0,{"$f":"T3*IF(ValYear=ToolYear,1,IF(ValYear = ToolYear-1, VLOOKUP(ToolYear-1,Trends!$A$3:$H$94,7), VLOOKUP(ToolYear-1,Trends!$A$3:$H$94,7) * VLOOKUP(ToolYear-2,Trends!$A$3:$H$94,7)))","v":211534.52471249996},{"$f":"U3*IF(ValYear=ToolYear,1,IF(ValYear = ToolYear-1, VLOOKUP(ToolYear-1,Trends!$A$3:$H$94,8), VLOOKUP(ToolYear-1,Trends!$A$3:$H$94,8) * VLOOKUP(ToolYear-2,Trends!$A$3:$H$94,8)))","v":149955.86833699996},{"$f":"W3*IF(ValYear=ToolYear,1,IF(ValYear=ToolYear-1, 1-O3, (1-O3)^2))","v":3.2851997449999994E-4},{"$f":"X3*IF(ValYear=ToolYear,1,IF(ValYear=ToolYear-1, 1-P3, (1-P3)^2))","v":1.8190364700000001E-4},4.0000000000000002E-4,1.9E-3,null,null,null,null,20,3.0000000000000001E-3,3.0000000000000001E-3,null,38510.04,0,193708.5,137319.07999999999,null,3.3049999999999996E-4,1.83E-4,null,"Sources"]
[{"$f":"1+A3","v":21},{"$f":"R4*IF(ValYear=ToolYear,1,IF(ValYear = ToolYear-1, VLOOKUP(ToolYear-1,Trends!$A$3:$H$94,IF(ExFlg=1,2,4)), VLOOKUP(ToolYear-1,Trends!$A$3:$H$94,IF(ExFlg=1,2,4)) * VLOOKUP(ToolYear-2,Trends!$A$3:$H$94,IF(ExFlg=1,2,4))))","v":43474.138196159998},0,{"$f":"T4*IF(ValYear=ToolYear,1,IF(ValYear = ToolYear-1, VLOOKUP(ToolYear-1,Trends!$A$3:$H$94,7), VLOOKUP(ToolYear-1,Trends!$A$3:$H$94,7) * VLOOKUP(ToolYear-2,Trends!$A$3:$H$94,7)))","v":211534.52471249996},{"$f":"U4*IF(ValYear=ToolYear,1,IF(ValYear = ToolYear-1, VLOOKUP(ToolYear-1,Trends!$A$3:$H$94,8), VLOOKUP(ToolYear-1,Trends!$A$3:$H$94,8) * VLOOKUP(ToolYear-2,Trends!$A$3:$H$94,8)))","v":149955.86833699996},3.3796306000000002E-4,1.8438866950000002E-4,4.0000000000000002E-4,1.9E-3,null,null,"Int Rt",null,21,3.0000000000000001E-3,3.0000000000000001E-3,null,38510.04,0,193708.5,137319.07999999999,null,3.4000000000000002E-4,1.8550000000000001E-4,null,"Mortality Assumption"]
[22,{"$f":"R5*IF(ValYear=ToolYear,1,IF(ValYear = ToolYear-1, VLOOKUP(ToolYear-1,Trends!$A$3:$H$94,IF(ExFlg=1,2,4)), VLOOKUP(ToolYear-1,Trends!$A$3:$H$94,IF(ExFlg=1,2,4)) * VLOOKUP(ToolYear-2,Trends!$A$3:$H$94,IF(ExFlg=1,2,4))))","v":43474.138196159998},0,{"$f":"T5*IF(ValYear=ToolYear,1,IF(ValYear = ToolYear-1, VLOOKUP(ToolYear-1,Trends!$A$3:$H$94,7), VLOOKUP(ToolYear-1,Trends!$A$3:$H$94,7) * VLOOKUP(ToolYear-2,Trends!$A$3:$H$94,7)))","v":211534.52471249996},{"$f":"U5*IF(ValYear=ToolYear,1,IF(ValYear = ToolYear-1, VLOOKUP(ToolYear-1,Trends!$A$3:$H$94,8), VLOOKUP(ToolYear-1,Trends!$A$3:$H$94,8) * VLOOKUP(ToolYear-2,Trends!$A$3:$H$94,8)))","v":149955.86833699996},3.4492112299999998E-4,1.873706965E-4,4.0000000000000002E-4,1.9E-3,null,null,3.5000000000000003E-2,null,22,3.0000000000000001E-3,3.0000000000000001E-3,null,38510.04,0,193708.5,137319.07999999999,null,3.4699999999999998E-4,1.885E-4,null,"Medical, Medicare, and LTC Costs"]
[23,{"$f":"R6*IF(ValYear=ToolYear,1,IF(ValYear = ToolYear-1, VLOOKUP(ToolYear-1,Trends!$A$3:$H$94,IF(ExFlg=1,2,4)), VLOOKUP(ToolYear-1,Trends!$A$3:$H$94,IF(ExFlg=1,2,4)) * VLOOKUP(ToolYear-2,Trends!$A$3:$H$94,IF(ExFlg=1,2,4))))","v":43474.138196159998},0,{"$f":"T6*IF(ValYear=ToolYear,1,IF(ValYear = ToolYear-1, VLOOKUP(ToolYear-1,Trends!$A$3:$H$94,7), VLOOKUP(ToolYear-1,Trends!$A$3:$H$94,7) * VLOOKUP(ToolYear-2,Trends!$A$3:$H$94,7)))","v":211534.52471249996},{"$f":"U6*IF(ValYear=ToolYear,1,IF(ValYear = ToolYear-1, VLOOKUP(ToolYear-1,Trends!$A$3:$H$94,8), VLOOKUP(ToolYear-1,Trends!$A$3:$H$94,8) * VLOOKUP(ToolYear-2,Trends!$A$3:$H$94,8)))","v":149955.86833699996},3.4939416349999999E-4,1.9184373700000001E-4,4.0000000000000002E-4,1.9E-3,null,null,null,null,23,3.0000000000000001E-3,3.0000000000000001E-3,null,38510.04,0,193708.5,137319.07999999999,null,3.5149999999999998E-4,1.93E-4,null,"LTC Probabilities"]
[24,{"$f":"R7*IF(ValYear=ToolYear,1,IF(ValYear = ToolYear-1, VLOOKUP(ToolYear-1,Trends!$A$3:$H$94,IF(ExFlg=1,2,4)), VLOOKUP(ToolYear-1,Trends!$A$3:$H$94,IF(ExFlg=1,2,4)) * VLOOKUP(ToolYear-2,Trends!$A$3:$H$94,IF(ExFlg=1,2,4))))","v":43474.138196159998},0,{"$f":"T7*IF(ValYear=ToolYear,1,IF(ValYear = ToolYear-1, VLOOKUP(ToolYear-1,Trends!$A$3:$H$94,7), VLOOKUP(ToolYear-1,Trends!$A$3:$H$94,7) * VLOOKUP(ToolYear-2,Trends!$A$3:$H$94,7)))","v":211534.52471249996},{"$f":"U7*IF(ValYear=ToolYear,1,IF(ValYear = ToolYear-1, VLOOKUP(ToolYear-1,Trends!$A$3:$H$94,8), VLOOKUP(ToolYear-1,Trends!$A$3:$H$94,8) * VLOOKUP(ToolYear-2,Trends!$A$3:$H$94,8)))","v":149955.86833699996},3.5337019950000006E-4,1.983047955E-4,4.0000000000000002E-4,1.9E-3,null,null,"Sens",null,24,3.0000000000000001E-3,3.0000000000000001E-3,null,38510.04,0,193708.5,137319.07999999999,null,3.5550000000000002E-4,1.995E-4]
[25,{"$f":"R8*IF(ValYear=ToolYear,1,IF(ValYear = ToolYear-1, VLOOKUP(ToolYear-1,Trends!$A$3:$H$94,IF(ExFlg=1,2,4)), VLOOKUP(ToolYear-1,Trends!$A$3:$H$94,IF(ExFlg=1,2,4)) * VLOOKUP(ToolYear-2,Trends!$A$3:$H$94,IF(ExFlg=1,2,4))))","v":43474.138196159998},0,{"$f":"T8*IF(ValYear=ToolYear,1,IF(ValYear = ToolYear-1, VLOOKUP(ToolYear-1,Trends!$A$3:$H$94,7), VLOOKUP(ToolYear-1,Trends!$A$3:$H$94,7) * VLOOKUP(ToolYear-2,Trends!$A$3:$H$94,7)))","v":211534.52471249996},{"$f":"U8*IF(ValYear=ToolYear,1,IF(ValYear = ToolYear-1, VLOOKUP(ToolYear-1,Trends!$A$3:$H$94,8), VLOOKUP(ToolYear-1,Trends!$A$3:$H$94,8) * VLOOKUP(ToolYear-2,Trends!$A$3:$H$94,8)))","v":149955.86833699996},3.5684923100000001E-4,2.0575986299999999E-4,4.0000000000000002E-4,1.9E-3,null,null,0,null,25,3.0000000000000001E-3,3.0000000000000001E-3,null,38510.04,0,193708.5,137319.07999999999,null,3.59E-4,2.0699999999999999E-4]
{"$rows_left_out":96}
{"sheet":"Trends","index":7,"n_rows":94,"n_cols":10,"rows_kept":94,"cut":false,"hidden":true,"merged":[[0,1,0,7]]}
["Beginning of ","Costs Trends"]
["Year","Placeholder","Placeholder","Medical \nNo Excise Tax - Age<65","Medical \n No Excise Tax - Age>=65","Medicare Part B","LTC Inst.","LTC Non-Inst."]
[{"$f":"ValYear","v":2018},{"$f":"D3","v":1.0640000000000001},{"$f":"E3","v":1.06},1.0640000000000001,1.06,1.026,1.0449999999999999,1.0449999999999999,null,"Trends Source:"]
[{"$f":"1+A3","v":2019},{"$f":"D4","v":1.0609999999999999},{"$f":"E4","v":1.056},1.0609999999999999,1.056,1.0469999999999999,1.0449999999999999,1.0449999999999999,null,"\\\\Moxee\\osaact\\OPEB2019\\LEOFF 1\\Assumptions\\2018 L1 Medical Cost Assumptions.xlsm"]
[2020,1.054,1.0529999999999999,1.054,1.0529999999999999,1.046,1.0449999999999999,1.0449999999999999]
[2021,1.0509999999999999,1.0509999999999999,1.0509999999999999,1.0509999999999999,1.0489999999999999,1.0449999999999999,1.0449999999999999]
[2022,1.0509999999999999,1.0509999999999999,1.0509999999999999,1.0509999999999999,1.0589999999999999,1.0449999999999999,1.0449999999999999]
[2023,1.0509999999999999,1.0509999999999999,1.0509999999999999,1.0509999999999999,1.0569999999999999,1.0449999999999999,1.0449999999999999]
{"$rows_left_out":86}