{"text_format":"1","workbook":"xlsx","n_sheets":9,"sheets":["Intro and Data Inputs","GASB Results","Additional Disclosures","Certification Letter","Active","Inactive","Log","Lookups","Trends"],"not_rendered":{"charts":0,"images":4,"macros":1,"external_links":0,"defined_names":18,"comments":4,"pivot_tables":0},"unopened":[],"bounds":{"document_bytes":16777216,"sheet_cells":100000,"rows_first":2000,"rows_last":500,"rows_between":2000,"halvings":0,"cell_chars":16384,"cell_head_chars":4096},"cells_cut":0,"cells_raw":0,"read":"whole","date_system":"1900"}

{"sheet":"Intro and Data Inputs","index":0,"n_rows":39,"n_cols":9,"rows_kept":39,"cut":false,"hidden":false,"merged":[[0,1,0,8],[2,1,2,8],[21,2,21,6],[19,2,19,7],[27,2,27,6],[8,2,8,7],[9,2,9,7],[10,2,10,7],[13,2,13,7],[4,2,4,7],[39,1,39,8],[33,2,33,7],[26,2,26,3],[22,2,22,6],[14,2,14,7],[15,2,15,7],[16,2,16,7],[17,2,17,7],[18,2,18,7]]}
[null,"GASB 75 Alternative Measurement Method for PEBB OPEB"]
[]
[null,"Welcome to the Office of the State Actuary's AMM Online Tool"]
[null,"Intended Use"]
[null,null,"This Alternate Measurement Method (AMM) Online Tool is intended to assist employers covering employees under Public Employees' Benefit Board (PEBB) health insurance with their reporting requirements for Other Post-Employment Benefits (OPEB) healthcare obligations under Governmental Accounting Standards Board Statement No. 75 (GASB 75).  Please review the following explanation and directions below, along with the Additional Disclosures and Certification Letter before proceeding."]
[]
{"$rows_left_out":34}
{"sheet":"GASB Results","index":1,"n_rows":55,"n_cols":8,"rows_kept":55,"cut":false,"hidden":false,"merged":[[26,2,26,6],[8,2,8,3],[7,2,7,3],[2,2,2,4],[3,2,3,4],[4,2,4,3],[5,2,5,3],[6,2,6,3],[10,2,10,3],[11,2,11,3],[12,2,12,3],[13,2,13,3],[14,2,14,3],[55,1,55,7],[34,4,34,5],[35,4,35,5],[36,4,36,5],[37,4,37,5],[38,4,38,5],[39,4,39,5],[40,4,40,5],[41,4,41,5],[43,4,43,5],[44,4,44,5],[50,4,50,5],[0,1,0,7],[42,4,42,5],[52,2,52,5],[51,2,51,5],[22,5,23,6],[45,4,45,5],[46,4,46,5],[47,4,47,5],[48,4,48,5],[49,4,49,5],[31,4,31,5],[32,4,32,5],[33,4,33,5],[15,2,15,3],[17,2,17,4],[9,2,9,3]]}
[null,"GASB 75 Reporting Results and Required Disclosures"]
[]
[null,null,"Schedule of Changes in Total Other Liability and Related Ratios"]
[null,null,"Measurement Date of June 30, 2018"]
[null,null,"Total OPEB Liability (TOL)"]
[null,null,"Service Cost",null,{"$f":"ROUND(Log!L5,0)","v":0}]
{"$rows_left_out":50}
{"sheet":"Additional Disclosures","index":2,"n_rows":49,"n_cols":4,"rows_kept":49,"cut":false,"hidden":false,"merged":[[49,1,49,3],[0,1,0,3]]}
[null,"AMM Online Tool Additional Disclosures"]
[]
[null,null,"This tab is intended to:"]
[null,null,"(1) Provide guidance on concepts that require users to apply their judgment and/or consult with their auditor."]
[null,null,"(2) Document the assumptions and methods we employed for purposes of this AMM Online Tool that vary\n     from the underlying GASB 75 actuarial valuation we performed for the State."]
[]
{"$rows_left_out":44}
{"sheet":"Certification Letter","index":3,"n_rows":115,"n_cols":4,"rows_kept":115,"cut":false,"hidden":false,"merged":[[0,1,0,3],[57,1,57,3],[58,1,58,3],[115,1,115,3]]}
[null,"GASB 75 AMM Online Tool Actuarial Certification"]
[]
[]
[]
[]
[]
{"$rows_left_out":110}
{"sheet":"Active","index":4,"n_rows":138,"n_cols":99,"rows_kept":138,"cut":false,"hidden":true,"merged":[[0,48,1,48]]}
["Actives",30040,null,"Insured",null,null,"UMP",null,null,"Pre-Med (Implicit)","Insured","Pst-Med (Explicit)","Insured",null,"Pre-Med (Implicit)","UMP","Pst-Med (Explicit)","UMP",null,null,"Insured",null,null,null,"UMP",null,null,"Average",null,null,null,0.5,null,null,null,null,null,null,null,null,null,null,null,null,null,null,null,null,"Survive pst Decrement",null,null,null,null,null,"Retires at age XX, implicit subsidy",null,null,null,null,null,null,null,null,null,null,"Retires at age XX, explicit subsidy",null,null,null,null,null,null,null,null,null,null,null,null,null,null,null,null,{"$f":"MAX(B2-35,0)","v":27}]
["Year",62,null,"Costs","Prem",null,"Costs","Prem",null,"Trend","Rel Trend","Trend","Rel Trend",null,"Trend","Rel Trend","Trend","Rel Trend",null,"Costs","Prem","Net",null,"Costs","Prem","Net",null,"Net",null,"Retire - M","Retire - F","Retire","Term - M","Term - F","Term","Dis - M","Dis - F","Disab","Mort - M","Mort - F","Death","Decrement","Survive","Interest",null,"Mort - M","Mort - F","Mortality",null,"Interest","Pay Timing",null,"Age","Net","Imp 55","Imp 56","Imp 57","Imp 58","Imp 59","Imp 60","Imp 61","Imp 62","Imp 63","Imp 64",null,"Exp 55","Exp 56","Exp 57","Exp 58","Exp 59","Exp 60","Exp 61","Exp 62","Exp 63","Exp 64","Exp 65","Exp 66","Exp 67","Exp 68","Exp 69","Exp 70",null,"Estimated MS"]
[{"$f":"ValYear - MS","v":1991},{"$f":"B2-MS","v":35},null,{"$f":"VLOOKUP(B3,Lookups!A:B,2)","v":9692.8994299832102},{"$f":"VLOOKUP(B3,Lookups!A:C,3)","v":9144.8049339914669},null,{"$f":"VLOOKUP(B3,Lookups!A:D,4)","v":6364.4466063110376},{"$f":"VLOOKUP(B3,Lookups!A:E,5)","v":8673.2778210000015},null,{"$f":"VLOOKUP(A3,Trends!$A$3:$Q$94,IF(ExFlg=0,2,10))+IF(B3>=$B$2,Sens,0)","v":1.048},{"$f":"IF(B3=$B$2,1,IF(B3<$B$2,K4/J3,K2*J2))","v":0.28199757164502287},{"$f":"VLOOKUP(A3,Trends!$A$3:$Q$94,IF(ExFlg=0,4,12))+IF(B3>=$B$2,Sens,0)","v":1.0489999999999999},{"$f":"IF(B3=$B$2,1,IF(B3<$B$2,M4/L3,M2*L2))","v":0.2748285324404624},null,{"$f":"VLOOKUP(A3,Trends!$A$3:$Q$94,IF(ExFlg=0,6,14))+IF(B3>=$B$2,Sens,0)","v":1.048},{"$f":"IF(B3=$B$2,1,IF(B3<$B$2,P4/O3,P2*O2))","v":0.28199757164502287},{"$f":"VLOOKUP(A3,Trends!$A$3:$Q$94,IF(ExFlg=0,8,16))+IF(B3>=$B$2,Sens,0)","v":1.048},{"$f":"IF(B3=$B$2,1,IF(B3<$B$2,R4/Q3,R2*Q2))","v":0.28199757164502287},null,{"$f":"IF(B3<65,D3*K3,D3*M3)","v":2733.3741014546918},{"$f":"IF(B3=$B$2, E3, IF(B3<$B$2, E3 * Trends!$S$3^(B3 - $B$2), IF(ExFlg=0,E3*VLOOKUP(A3,Trends!$A$4:$V$94,20),E3*VLOOKUP(A3,Trends!$A$4:$Z$94,24))))","v":2715.3071531878954},{"$f":"T3-U3","v":18.066948266796317},null,{"$f":"IF(B3<65,G3*P3,G3*R3)","v":1794.7584878441196},{"$f":"IF(B3=$B$2, H3, IF(B3<$B$2, H3 * Trends!$U$3^(B3 - $B$2), IF(ExFlg=0,H3*VLOOKUP(A3,Trends!$A$4:$V$94,22),H3*VLOOKUP(A3,Trends!$A$4:$Z$94,26))))","v":2575.2996897078706},{"$f":"X3-Y3","v":-780.54120186375098},null,{"$f":"(1-PctUMP)*V3+PctUMP*Z3","v":-514.34114718073567},null,{"$f":"IF(B3<71,VLOOKUP(B3,Lookups!A:F,6),\"\")","v":0},{"$f":"IF(B3<71,VLOOKUP(Active!B3,Lookups!A:G,7),\"\")","v":0},{"$f":"IF(B3<71,PCTMALE*AD3+(1-PCTMALE)*AE3,\"\")","v":0},{"$f":"IF(B3<55,VLOOKUP(B3-$B$3,Lookups!$O$3:$Q$53,2),\"\")","v":0.26239699999999999},{"$f":"IF(B3<55,VLOOKUP(B3-$B$3,Lookups!$O$3:$Q$53,3),\"\")","v":0.26239699999999999},{"$f":"IF(B3<55,PCTMALE*AG3+(1-PCTMALE)*AH3,\"\")","v":0.26239699999999999},{"$f":"IF(B3<55,VLOOKUP(B3,Lookups!A:M,12),\"\")","v":1.56E-4},{"$f":"IF(B3<55,VLOOKUP(B3,Lookups!A:M,13),\"\")","v":1.94E-4},{"$f":"IF(B3<55,PCTMALE*AJ3+(1-PCTMALE)*AK3,\"\")","v":1.75E-4},{"$f":"IF(B3<70,VLOOKUP(B3,Lookups!A:H,8)*(1-VLOOKUP(B3,Lookups!$U$3:$W$103,2))^(A3-2018),\"\")","v":7.211944416426944E-4},{"$f":"IF(B3<70,VLOOKUP(B3,Lookups!A:I,9)*(1-VLOOKUP(B3,Lookups!$U$3:$W$103,3))^(A3-2018),\"\")","v":4.4681520294254144E-4},{"$f":"IF(AM3<>\"\",PCTMALE*AM3+(1-PCTMALE)*AN3,\"\")","v":5.8400482229261795E-4},{"$f":"IF(B3<71,SUM(AF3,AI3,AL3,AO3),\"\")","v":0.26315600482229257},{"$f":"IF(B3<71,IF(B3=$B$2,1, IF(B3<$B$2, AQ4/(1-AP3), AQ2*(1-AP2))),\"\")","v":5.431523599554466},{"$f":"IF(B3<71,IF(B3=$B$2,1,IF(B3<$B$2,AR4*(1+IntRt),AR2/(1+IntRt))),\"\")","v":2.5849341279209068},null,{"$f":"IF(BA3>=$B$3,VLOOKUP(BA3,Lookups!A:H,8)*(1-VLOOKUP(BA3,Lookups!U:W,2))^(BA3-$B$3),\"\")","v":""},{"$f":"IF(BA3>=$B$3,VLOOKUP(BA3,Lookups!A:I,9)*(1-VLOOKUP(BA3,Lookups!U:W,3))^(BA3-$B$3),\"\")","v":""},{"$f":"IFERROR(PCTMALE*AT3+(1-PCTMALE)*AU3,\"\")","v":""}]
[{"$f":"1+A3","v":1992},36,null,{"$f":"VLOOKUP(B4,Lookups!A:B,2)","v":10559.050808535665},{"$f":"VLOOKUP(B4,Lookups!A:C,3)","v":9144.8049339914669},null,{"$f":"VLOOKUP(B4,Lookups!A:D,4)","v":6933.1695335938675},{"$f":"VLOOKUP(B4,Lookups!A:E,5)","v":8673.2778210000015},null,{"$f":"VLOOKUP(A4,Trends!$A$3:$Q$94,IF(ExFlg=0,2,10))+IF(B4>=$B$2,Sens,0)","v":1.048},0.29553345508398399,{"$f":"VLOOKUP(A4,Trends!$A$3:$Q$94,IF(ExFlg=0,4,12))+IF(B4>=$B$2,Sens,0)","v":1.0489999999999999},{"$f":"IF(B4=$B$2,1,IF(B4<$B$2,M5/L4,M3*L3))","v":0.28829513053004502},null,{"$f":"VLOOKUP(A4,Trends!$A$3:$Q$94,IF(ExFlg=0,6,14))+IF(B4>=$B$2,Sens,0)","v":1.048},0.29553345508398399,{"$f":"VLOOKUP(A4,Trends!$A$3:$Q$94,IF(ExFlg=0,8,16))+IF(B4>=$B$2,Sens,0)","v":1.048},0.29553345508398399,null,{"$f":"IF(B4<65,D4*K4,D4*M4)","v":3120.5527678538797},{"$f":"IF(B4=$B$2, E4, IF(B4<$B$2, E4 * Trends!$S$3^(B4 - $B$2), IF(ExFlg=0,E4*VLOOKUP(A4,Trends!$A$4:$V$94,20),E4*VLOOKUP(A4,Trends!$A$4:$Z$94,24))))","v":2840.2112822345393},280.34148561934035,null,{"$f":"IF(B4<65,G4*P4,G4*R4)","v":2048.9835469460095},{"$f":"IF(B4=$B$2, H4, IF(B4<$B$2, H4 * Trends!$U$3^(B4 - $B$2), IF(ExFlg=0,H4*VLOOKUP(A4,Trends!$A$4:$V$94,22),H4*VLOOKUP(A4,Trends!$A$4:$Z$94,26))))","v":2693.7634754344331},{"$f":"X4-Y4","v":-644.77992848842359},null,{"$f":"(1-PctUMP)*V4+PctUMP*Z4","v":-336.40920752388263},null,{"$f":"IF(B4<71,VLOOKUP(B4,Lookups!A:F,6),\"\")","v":0},{"$f":"IF(B4<71,VLOOKUP(Active!B4,Lookups!A:G,7),\"\")","v":0},0,{"$f":"IF(B4<55,VLOOKUP(B4-$B$3,Lookups!$O$3:$Q$53,2),\"\")","v":0.154534},{"$f":"IF(B4<55,VLOOKUP(B4-$B$3,Lookups!$O$3:$Q$53,3),\"\")","v":0.16774700000000001},0.16114050000000002,{"$f":"IF(B4<55,VLOOKUP(B4,Lookups!A:M,12),\"\")","v":1.64E-4},{"$f":"IF(B4<55,VLOOKUP(B4,Lookups!A:M,13),\"\")","v":2.2800000000000001E-4},1.9599999999999999E-4,{"$f":"IF(B4<70,VLOOKUP(B4,Lookups!A:H,8)*(1-VLOOKUP(B4,Lookups!$U$3:$W$103,2))^(A4-2018),\"\")","v":7.914745688550449E-4},{"$f":"IF(B4<70,VLOOKUP(B4,Lookups!A:I,9)*(1-VLOOKUP(B4,Lookups!$U$3:$W$103,3))^(A4-2018),\"\")","v":4.8656223495187188E-4},6.3901840190345842E-4,{"$f":"IF(B4<71,SUM(AF4,AI4,AL4,AO4),\"\")","v":0.16197551840190347},{"$f":"IF(B4<71,IF(B4=$B$2,1, IF(B4<$B$2, AQ5/(1-AP4), AQ3*(1-AP3))),\"\")","v":4.0021855489977156},2.4955919365909507,null,{"$f":"IF(BA4>=$B$3,VLOOKUP(BA4,Lookups!A:H,8)*(1-VLOOKUP(BA4,Lookups!U:W,2))^(BA4-$B$3),\"\")","v":""},{"$f":"IF(BA4>=$B$3,VLOOKUP(BA4,Lookups!A:I,9)*(1-VLOOKUP(BA4,Lookups!U:W,3))^(BA4-$B$3),\"\")","v":""},""]
[1993,37,null,{"$f":"VLOOKUP(B5,Lookups!A:B,2)","v":10781.988530791481},{"$f":"VLOOKUP(B5,Lookups!A:C,3)","v":9144.8049339914669},null,{"$f":"VLOOKUP(B5,Lookups!A:D,4)","v":7079.5524849917001},{"$f":"VLOOKUP(B5,Lookups!A:E,5)","v":8673.2778210000015},null,{"$f":"VLOOKUP(A5,Trends!$A$3:$Q$94,IF(ExFlg=0,2,10))+IF(B5>=$B$2,Sens,0)","v":1.048},0.30971906092801521,{"$f":"VLOOKUP(A5,Trends!$A$3:$Q$94,IF(ExFlg=0,4,12))+IF(B5>=$B$2,Sens,0)","v":1.0489999999999999},0.3024215919260172,null,{"$f":"VLOOKUP(A5,Trends!$A$3:$Q$94,IF(ExFlg=0,6,14))+IF(B5>=$B$2,Sens,0)","v":1.048},0.30971906092801521,{"$f":"VLOOKUP(A5,Trends!$A$3:$Q$94,IF(ExFlg=0,8,16))+IF(B5>=$B$2,Sens,0)","v":1.048},0.30971906092801521,null,{"$f":"IF(B5<65,D5*K5,D5*M5)","v":3339.3873626933678},{"$f":"IF(B5=$B$2, E5, IF(B5<$B$2, E5 * Trends!$S$3^(B5 - $B$2), IF(ExFlg=0,E5*VLOOKUP(A5,Trends!$A$4:$V$94,20),E5*VLOOKUP(A5,Trends!$A$4:$Z$94,24))))","v":2970.8610012173281},368.52636147603971,null,2192.6723474422261,{"$f":"IF(B5=$B$2, H5, IF(B5<$B$2, H5 * Trends!$U$3^(B5 - $B$2), IF(ExFlg=0,H5*VLOOKUP(A5,Trends!$A$4:$V$94,22),H5*VLOOKUP(A5,Trends!$A$4:$Z$94,26))))","v":2817.6765953044169},{"$f":"X5-Y5","v":-625.00424786219082},null,{"$f":"(1-PctUMP)*V5+PctUMP*Z5","v":-293.83068985147844},null,{"$f":"IF(B5<71,VLOOKUP(B5,Lookups!A:F,6),\"\")","v":0},{"$f":"IF(B5<71,VLOOKUP(Active!B5,Lookups!A:G,7),\"\")","v":0},0,{"$f":"IF(B5<55,VLOOKUP(B5-$B$3,Lookups!$O$3:$Q$53,2),\"\")","v":0.10068299999999999},{"$f":"IF(B5<55,VLOOKUP(B5-$B$3,Lookups!$O$3:$Q$53,3),\"\")","v":0.117007},0.108845,{"$f":"IF(B5<55,VLOOKUP(B5,Lookups!A:M,12),\"\")","v":1.7100000000000001E-4},{"$f":"IF(B5<55,VLOOKUP(B5,Lookups!A:M,13),\"\")","v":2.6200000000000003E-4},2.165E-4,{"$f":"IF(B5<70,VLOOKUP(B5,Lookups!A:H,8)*(1-VLOOKUP(B5,Lookups!$U$3:$W$103,2))^(A5-2018),\"\")","v":8.5917051322860439E-4},{"$f":"IF(B5<70,VLOOKUP(B5,Lookups!A:I,9)*(1-VLOOKUP(B5,Lookups!$U$3:$W$103,3))^(A5-2018),\"\")","v":5.2498875776954882E-4},6.9207963549907661E-4,0.10975357963549907,3.3539294699582038,2.4093376487651579,null,{"$f":"IF(BA5>=$B$3,VLOOKUP(BA5,Lookups!A:H,8)*(1-VLOOKUP(BA5,Lookups!U:W,2))^(BA5-$B$3),\"\")","v":""},{"$f":"IF(BA5>=$B$3,VLOOKUP(BA5,Lookups!A:I,9)*(1-VLOOKUP(BA5,Lookups!U:W,3))^(BA5-$B$3),\"\")","v":""},""]
[1994,38,null,{"$f":"VLOOKUP(B6,Lookups!A:B,2)","v":11009.645929127035},{"$f":"VLOOKUP(B6,Lookups!A:C,3)","v":9144.8049339914669},null,{"$f":"VLOOKUP(B6,Lookups!A:D,4)","v":7229.0344189487596},{"$f":"VLOOKUP(B6,Lookups!A:E,5)","v":8673.2778210000015},null,{"$f":"VLOOKUP(A6,Trends!$A$3:$Q$94,IF(ExFlg=0,2,10))+IF(B6>=$B$2,Sens,0)","v":1.048},0.32458557585255993,{"$f":"VLOOKUP(A6,Trends!$A$3:$Q$94,IF(ExFlg=0,4,12))+IF(B6>=$B$2,Sens,0)","v":1.0489999999999999},0.31724024993039202,null,{"$f":"VLOOKUP(A6,Trends!$A$3:$Q$94,IF(ExFlg=0,6,14))+IF(B6>=$B$2,Sens,0)","v":1.048},0.32458557585255993,{"$f":"VLOOKUP(A6,Trends!$A$3:$Q$94,IF(ExFlg=0,8,16))+IF(B6>=$B$2,Sens,0)","v":1.048},0.32458557585255993,null,{"$f":"IF(B6<65,D6*K6,D6*M6)","v":3573.5722638384909},{"$f":"IF(B6=$B$2, E6, IF(B6<$B$2, E6 * Trends!$S$3^(B6 - $B$2), IF(ExFlg=0,E6*VLOOKUP(A6,Trends!$A$4:$V$94,20),E6*VLOOKUP(A6,Trends!$A$4:$Z$94,24))))","v":3107.5206072733249},466.05165656516601,null,2346.4402997324592,{"$f":"IF(B6=$B$2, H6, IF(B6<$B$2, H6 * Trends!$U$3^(B6 - $B$2), IF(ExFlg=0,H6*VLOOKUP(A6,Trends!$A$4:$V$94,22),H6*VLOOKUP(A6,Trends!$A$4:$Z$94,26))))","v":2947.2897186884202},-600.84941895596103,null,-245.2192834525037,null,{"$f":"IF(B6<71,VLOOKUP(B6,Lookups!A:F,6),\"\")","v":0},{"$f":"IF(B6<71,VLOOKUP(Active!B6,Lookups!A:G,7),\"\")","v":0},0,{"$f":"IF(B6<55,VLOOKUP(B6-$B$3,Lookups!$O$3:$Q$53,2),\"\")","v":7.5235999999999997E-2},{"$f":"IF(B6<55,VLOOKUP(B6-$B$3,Lookups!$O$3:$Q$53,3),\"\")","v":9.2904E-2},8.4070000000000006E-2,{"$f":"IF(B6<55,VLOOKUP(B6,Lookups!A:M,12),\"\")","v":1.92E-4},{"$f":"IF(B6<55,VLOOKUP(B6,Lookups!A:M,13),\"\")","v":2.6600000000000001E-4},2.2900000000000001E-4,{"$f":"IF(B6<70,VLOOKUP(B6,Lookups!A:H,8)*(1-VLOOKUP(B6,Lookups!$U$3:$W$103,2))^(A6-2018),\"\")","v":9.2000452879010576E-4},{"$f":"IF(B6<70,VLOOKUP(B6,Lookups!A:I,9)*(1-VLOOKUP(B6,Lookups!$U$3:$W$103,3))^(A6-2018),\"\")","v":5.6425511403598774E-4},7.4212982141304675E-4,8.5041129821413042E-2,2.9858237047852989,2.3260645382942244,null,{"$f":"IF(BA6>=$B$3,VLOOKUP(BA6,Lookups!A:H,8)*(1-VLOOKUP(BA6,Lookups!U:W,2))^(BA6-$B$3),\"\")","v":""},{"$f":"IF(BA6>=$B$3,VLOOKUP(BA6,Lookups!A:I,9)*(1-VLOOKUP(BA6,Lookups!U:W,3))^(BA6-$B$3),\"\")","v":""},""]
{"$rows_left_out":133}
{"sheet":"Inactive","index":5,"n_rows":101,"n_cols":39,"rows_kept":101,"cut":false,"hidden":true,"merged":[]}
["Inactives",9642,null,"Insured",null,null,"UMP",null,null,"Implicit","Insured","Explicit","Insured",null,"Implicit","UMP","Explicit","UMP",null,null,"Insured",null,null,null,"UMP",null,null,"Average",null,null,null,0.5,null,null,null,null,"Implicit","Explicit"]
["Year",null,null,"Cost","Prem",null,"Cost","Prem",null,"Trend","Rel Trend","Trend","Rel Trend",null,"Trend","Rel Trend","Trend","Rel Trend",null,"Cost","Prem","Net",null,"Cost","Prem","Net",null,"Net",null,"Mort - M","Mort - F","Mortality","Survive","Interest","Pay Timing",null,"Subsidy","Subsidy"]
[{"$f":"ValYear","v":2018},84,null,{"$f":"VLOOKUP(B3,Lookups!A:B,2)","v":4637.4129400229613},{"$f":"VLOOKUP(B3,Lookups!A:C,3)","v":2474.1039835459746},null,{"$f":"VLOOKUP(B3,Lookups!A:D,4)","v":6593.4005386657245},{"$f":"VLOOKUP(B3,Lookups!A:E,5)","v":3826.6272213000002},null,{"$f":"VLOOKUP(A3,Trends!$A$3:$Q$94,IF(ExFlg=0,2,10))+Sens","v":1.0685},1,{"$f":"VLOOKUP(A3,Trends!$A$3:$Q$94,IF(ExFlg=0,4,12))+Sens","v":1.0740000000000001},1,null,{"$f":"VLOOKUP(A3,Trends!$A$3:$Q$94,IF(ExFlg=0,6,14))+Sens","v":1.0685},1,{"$f":"VLOOKUP(A3,Trends!$A$3:$Q$94,IF(ExFlg=0,8,16))+Sens","v":1.0740000000000001},1,null,{"$f":"IF(B3<65,D3*K3,D3*M3)","v":4637.4129400229613},{"$f":"IF(ExFlg=0,E3*VLOOKUP(A3,Trends!$A$3:$Z$94,20),E3*VLOOKUP(A3,Trends!$A$3:$Z$94,24))","v":2474.1039835459746},{"$f":"T3-U3","v":2163.3089564769866},null,{"$f":"IF(B3<65,G3*P3,G3*R3)","v":6593.4005386657245},{"$f":"IF(ExFlg=0,H3*VLOOKUP(A3,Trends!$A$3:$Z$94,22),H3*VLOOKUP(A3,Trends!$A$3:$Z$94,26))","v":3826.6272213000002},{"$f":"X3-Y3","v":2766.7733173657243},null,{"$f":"(1-PctUMP)*V3+PctUMP*Z3","v":2565.6205419506814},null,{"$f":"IF($B3<121,VLOOKUP($B3,Lookups!A:H,8)*(1-VLOOKUP($B3,Lookups!$U$3:$W$103,2))^($A3-2018),\"\")","v":6.8348999999999993E-2},{"$f":"IF($B3<121,VLOOKUP($B3,Lookups!A:I,9)*(1-VLOOKUP($B3,Lookups!$U$3:$W$103,3))^($A3-2018),\"\")","v":5.0298000000000002E-2},{"$f":"IF(B3<121,(PCTMALE*AD3+(1-PCTMALE)*AE3),\"\")","v":5.9323500000000001E-2},1,1,{"$f":"IF(AF3=\"\",\"\",ROUND((13/24)+(11/24)*(1/(1+IntRt))*(1-AF3),6))","v":0.95790900000000001},null,{"$f":"IF(B3<65,AB3*AG3*AH3*AI3,\"\")","v":""},{"$f":"IF(AND(B3>=65,B3<121),AB3*AG3*AH3*AI3,\"\")","v":2457.6310077194353}]
[{"$f":"1+A3","v":2019},{"$f":"1+B3","v":85},null,{"$f":"VLOOKUP(B4,Lookups!A:B,2)","v":4623.6824722232459},{"$f":"VLOOKUP(B4,Lookups!A:C,3)","v":2474.1039835459746},null,{"$f":"VLOOKUP(B4,Lookups!A:D,4)","v":6573.8787829063167},{"$f":"VLOOKUP(B4,Lookups!A:E,5)","v":3826.6272213000002},null,{"$f":"VLOOKUP(A4,Trends!$A$3:$Q$94,IF(ExFlg=0,2,10))+Sens","v":1.0625},{"$f":"K3*J3","v":1.0685},{"$f":"VLOOKUP(A4,Trends!$A$3:$Q$94,IF(ExFlg=0,4,12))+Sens","v":1.0634999999999999},{"$f":"M3*L3","v":1.0740000000000001},null,{"$f":"VLOOKUP(A4,Trends!$A$3:$Q$94,IF(ExFlg=0,6,14))+Sens","v":1.0625},{"$f":"P3*O3","v":1.0685},{"$f":"VLOOKUP(A4,Trends!$A$3:$Q$94,IF(ExFlg=0,8,16))+Sens","v":1.0640000000000001},{"$f":"R3*Q3","v":1.0740000000000001},null,{"$f":"IF(B4<65,D4*K4,D4*M4)","v":4965.8349751677661},{"$f":"IF(ExFlg=0,E4*VLOOKUP(A4,Trends!$A$3:$Z$94,20),E4*VLOOKUP(A4,Trends!$A$3:$Z$94,24))","v":2728.1944626561462},2237.6405125116198,null,{"$f":"IF(B4<65,G4*P4,G4*R4)","v":7060.3458128413849},{"$f":"IF(ExFlg=0,H4*VLOOKUP(A4,Trends!$A$3:$Z$94,22),H4*VLOOKUP(A4,Trends!$A$3:$Z$94,26))","v":4180.5902392702501},2879.7555735711348,null,{"$f":"(1-PctUMP)*V4+PctUMP*Z4","v":2665.7193602681668},null,{"$f":"IF($B4<121,VLOOKUP($B4,Lookups!A:H,8)*(1-VLOOKUP($B4,Lookups!$U$3:$W$103,2))^($A4-2018),\"\")","v":7.4873789999999996E-2},{"$f":"IF($B4<121,VLOOKUP($B4,Lookups!A:I,9)*(1-VLOOKUP($B4,Lookups!$U$3:$W$103,3))^($A4-2018),\"\")","v":5.5267732E-2},6.5070761000000005E-2,{"$f":"IF(B4<121,AG3*(1-AF3),\"\")","v":0.94067650000000003},{"$f":"IF(B4<121,AH3/(1+IntRt),\"\")","v":0.9654373431164317},0.95536500000000002,null,{"$f":"IF(B4<65,AB4*AG4*AH4*AI4,\"\")","v":""},2312.8535858630303]
[2020,86,null,{"$f":"VLOOKUP(B5,Lookups!A:B,2)","v":4610.0170996999877},{"$f":"VLOOKUP(B5,Lookups!A:C,3)","v":2474.1039835459746},null,{"$f":"VLOOKUP(B5,Lookups!A:D,4)","v":6554.4495785422914},{"$f":"VLOOKUP(B5,Lookups!A:E,5)","v":3826.6272213000002},null,{"$f":"VLOOKUP(A5,Trends!$A$3:$Q$94,IF(ExFlg=0,2,10))+Sens","v":1.0555000000000001},{"$f":"K4*J4","v":1.13528125},{"$f":"VLOOKUP(A5,Trends!$A$3:$Q$94,IF(ExFlg=0,4,12))+Sens","v":1.0535000000000001},{"$f":"M4*L4","v":1.142199},null,{"$f":"VLOOKUP(A5,Trends!$A$3:$Q$94,IF(ExFlg=0,6,14))+Sens","v":1.0549999999999999},{"$f":"P4*O4","v":1.13528125},{"$f":"VLOOKUP(A5,Trends!$A$3:$Q$94,IF(ExFlg=0,8,16))+Sens","v":1.054},{"$f":"R4*Q4","v":1.1427360000000002},null,5265.5569212602259,{"$f":"IF(ExFlg=0,E5*VLOOKUP(A5,Trends!$A$3:$Z$94,20),E5*VLOOKUP(A5,Trends!$A$3:$Z$94,24))","v":2901.434811034811},2364.1221102254149,null,7490.0054935851049,{"$f":"IF(ExFlg=0,H5*VLOOKUP(A5,Trends!$A$3:$Z$94,22),H5*VLOOKUP(A5,Trends!$A$3:$Z$94,26))","v":4448.1480145835467},3041.8574790015582,null,2815.9479485274064,null,{"$f":"IF($B5<121,VLOOKUP($B5,Lookups!A:H,8)*(1-VLOOKUP($B5,Lookups!$U$3:$W$103,2))^($A5-2018),\"\")","v":8.1864674824999997E-2},{"$f":"IF($B5<121,VLOOKUP($B5,Lookups!A:I,9)*(1-VLOOKUP($B5,Lookups!$U$3:$W$103,3))^($A5-2018),\"\")","v":6.0833294080000003E-2},7.13489844525E-2,{"$f":"IF(B5<121,AG4*(1-AF4),\"\")","v":0.87946596429018353},0.93206926348371466,0.95258699999999996,null,"",2198.8545196217783]
[2021,87,null,{"$f":"VLOOKUP(B6,Lookups!A:B,2)","v":4596.4164781780946},{"$f":"VLOOKUP(B6,Lookups!A:C,3)","v":2474.1039835459746},null,{"$f":"VLOOKUP(B6,Lookups!A:D,4)","v":6535.1124360889808},{"$f":"VLOOKUP(B6,Lookups!A:E,5)","v":3826.6272213000002},null,{"$f":"VLOOKUP(A6,Trends!$A$3:$Q$94,IF(ExFlg=0,2,10))+Sens","v":1.056},1.1982893593750001,{"$f":"VLOOKUP(A6,Trends!$A$3:$Q$94,IF(ExFlg=0,4,12))+Sens","v":1.054},1.2033066465000002,null,{"$f":"VLOOKUP(A6,Trends!$A$3:$Q$94,IF(ExFlg=0,6,14))+Sens","v":1.0549999999999999},1.19772171875,{"$f":"VLOOKUP(A6,Trends!$A$3:$Q$94,IF(ExFlg=0,8,16))+Sens","v":1.0545},1.2044437440000002,null,5530.8984982738248,{"$f":"IF(ExFlg=0,E6*VLOOKUP(A6,Trends!$A$3:$Z$94,20),E6*VLOOKUP(A6,Trends!$A$3:$Z$94,24))","v":3056.6615734251741},2474.2369248486507,null,7871.1752899839739,{"$f":"IF(ExFlg=0,H6*VLOOKUP(A6,Trends!$A$3:$Z$94,22),H6*VLOOKUP(A6,Trends!$A$3:$Z$94,26))","v":4688.348007371058},3182.827282612916,null,2946.6328586593531,null,{"$f":"IF($B6<121,VLOOKUP($B6,Lookups!A:H,8)*(1-VLOOKUP($B6,Lookups!$U$3:$W$103,2))^($A6-2018),\"\")","v":9.1328251680143982E-2},{"$f":"IF($B6<121,VLOOKUP($B6,Lookups!A:I,9)*(1-VLOOKUP($B6,Lookups!$U$3:$W$103,3))^($A6-2018),\"\")","v":6.7032726055359995E-2},7.9180488867751989E-2,0.81671696087754031,0.89985447333820678,0.94912200000000002,null,"",2055.3790347365125]
{"$rows_left_out":96}
{"sheet":"Log","index":6,"n_rows":33,"n_cols":12,"rows_kept":33,"cut":false,"hidden":true,"merged":[[0,1,0,4],[0,6,0,9]]}
[null,"Actives Cohort",null,null,null,null,"Inactive Cohorts"]
[null,"1","2","3","4",null,"1","2","3","4"]
[null,"20-38","39-48","49-56","57+",null,"20-65","66-70","71-77","78+",null,"Total"]
["Run 1 - EoP Data, BoP Discount Rate, New HC Assumptions"]
["Service Cost (EANC)",null,null,null,null,null,null,null,null,null,null,{"$f":"SUM(B5:E5)","v":0}]
["Total OPEB Liability (TOL)",null,null,null,null,null,null,null,null,null,null,{"$f":"SUM(B6:E6,G6:J6)","v":0}]
{"$rows_left_out":28}
{"sheet":"Lookups","index":7,"n_rows":103,"n_cols":25,"rows_kept":103,"cut":false,"hidden":true,"merged":[]}
[null,"Insured","Insured","UMP ","UMP","Retire","Retire","Mortality","Mortality",null,null,"Disability","Disability",null,null,"Term ","Term","2017 Discount",3.5799999999999998E-2,null,null,"100% Scale BB"]
["Age","Gross","Premium","Gross","Premium","Male","Female","Male","Female",null,null,"Male","Female",null,"MS","Male","Female","2018 Discount",3.8699999999999998E-2,null,"Age","Male","Female"]
[20,3375.508414025061,9144.8049339914669,2216.3897641747367,8673.2778210000015,0,0,3.1399999999999999E-4,1.8000000000000001E-4,null,null,0,0,null,0,0.26239699999999999,0.26239699999999999,null,null,null,20,3.0000000000000001E-3,3.0000000000000001E-3,null,"Sources"]
[{"$f":"1+A3","v":21},3812.2898352502189,9144.8049339914669,2503.1844513705441,8673.2778210000015,0,0,3.2699999999999998E-4,1.8100000000000001E-4,null,null,0,0,null,{"$f":"1+O3","v":1},0.154534,0.16774700000000001,null,"Int Rt",null,21,3.0000000000000001E-3,3.0000000000000001E-3,null,"Premiums/Costs/Trends"]
[22,4310.1003392328566,9144.8049339914669,2830.0513943219185,8673.2778210000015,0,0,3.3799999999999998E-4,1.8200000000000001E-4,null,null,0,0,null,2,0.10068299999999999,0.117007,null,3.5799999999999998E-2,null,22,3.0000000000000001E-3,3.0000000000000001E-3,null,"Mortality"]
[23,4877.9623592737744,9144.8049339914669,3202.9148055543451,8673.2778210000015,0,0,3.4699999999999998E-4,1.84E-4,null,null,1.7E-5,0,null,3,7.5235999999999997E-2,9.2904E-2,null,null,null,23,3.0000000000000001E-3,3.0000000000000001E-3]
{"$rows_left_out":98}
{"sheet":"Trends","index":8,"n_rows":94,"n_cols":26,"rows_kept":94,"cut":false,"hidden":true,"merged":[[0,22,0,25],[1,22,1,23],[1,24,1,25],[0,1,0,8],[0,9,0,16],[0,18,0,21],[1,18,1,19],[1,20,1,21],[1,1,1,2],[1,3,1,4],[1,5,1,6],[1,7,1,8],[1,9,1,10],[1,15,1,16],[1,13,1,14],[1,11,1,12]]}
["Beginning of ","Costs w/o Excise Tax",null,null,null,null,null,null,null,"Costs w/ Excise Tax",null,null,null,null,null,null,null,null,"Premiums w/o Excise Tax",null,null,null,"Premiums w/ Excise Tax"]
["Year","Insured Non-Med",null,"Insured Medicare",null,"UMP Non-Med",null,"UMP Medicare",null,"Insured Non-Med",null,"Insured Medicare",null,"UMP Non-Med",null,"UMP Medicare",null,null,"Insured Medicare",null,"UMP Medicare",null,"Insured Medicare",null,"UMP Medicare"]
[1950,1.046,null,1.046,null,1.046,null,1.046,null,1.048,null,1.0489999999999999,null,1.048,null,1.048,null,null,1.046,null,1.046,null,1.0489999999999999,null,1.048]
[2018,1.0685,null,1.0740000000000001,null,1.0685,null,1.0740000000000001,null,1.0685,null,1.0740000000000001,null,1.0685,null,1.0740000000000001,null,null,{"$f":"110.27%+Sens","v":1.1027},1,{"$f":"109.25% + Sens","v":1.0925},1,{"$f":"110.27%+Sens","v":1.1027},1,{"$f":"109.25% + Sens","v":1.0925},1]
[{"$f":"1+A4","v":2019},1.0620000000000001,null,1.0634999999999999,null,1.0625,null,1.0640000000000001,null,1.0625,null,1.0634999999999999,null,1.0625,null,1.0640000000000001,null,null,{"$f":"D5+Sens","v":1.0634999999999999},{"$f":"T4*S4","v":1.1027},{"$f":"H5+Sens","v":1.0640000000000001},{"$f":"V4*U4","v":1.0925},{"$f":"L5+Sens","v":1.0634999999999999},{"$f":"X4*W4","v":1.1027},{"$f":"P5+Sens","v":1.0640000000000001},{"$f":"Z4*Y4","v":1.0925}]
[2020,1.0545,null,1.0535000000000001,null,1.0549999999999999,null,1.054,null,1.0555000000000001,null,1.0535000000000001,null,1.0549999999999999,null,1.054,null,null,1.0535000000000001,{"$f":"T5*S5","v":1.1727214499999998},1.054,1.16242,1.0535000000000001,{"$f":"X5*W5","v":1.1727214499999998},1.054,{"$f":"Z5*Y5","v":1.16242}]
{"$rows_left_out":88}