{"text_format":"1","workbook":"xlsx","n_sheets":8,"sheets":["Intro and Data Inputs","GASB Results","Additional Disclosures","Certification Letter","Inactive","Log","Lookups","Trends"],"not_rendered":{"charts":0,"images":4,"macros":1,"external_links":0,"defined_names":26,"comments":3,"pivot_tables":0},"unopened":[],"bounds":{"document_bytes":16777216,"sheet_cells":100000,"rows_first":2000,"rows_last":500,"rows_between":2000,"halvings":0,"cell_chars":16384,"cell_head_chars":4096},"cells_cut":0,"cells_raw":0,"read":"whole","date_system":"1900"}

{"sheet":"Intro and Data Inputs","index":0,"n_rows":38,"n_cols":9,"rows_kept":38,"cut":false,"hidden":false,"merged":[[0,1,0,8],[2,1,2,8],[21,2,21,6],[19,2,19,7],[22,2,22,6],[8,2,8,7],[9,2,9,7],[10,2,10,7],[13,2,13,7],[4,2,4,7],[38,1,38,8],[29,2,29,7],[14,2,14,7],[15,2,15,7],[16,2,16,7],[17,2,17,7],[18,2,18,7],[26,2,26,3]]}
[null,"GASB 75 Alternative Measurement Method for LEOFF 1"]
[]
[null,"Welcome to the Office of the State Actuary's AMM Online Tool"]
[null,"Intended Use"]
[null,null,"This Alternative Measurement Method (AMM) Online Tool is intended to assist local government employers in Washington State covering Law Enforcement Officers' and Fire Fighters' Retirement System (LEOFF) Plan 1 retiree healthcare costs with their reporting requirements for Other Post-Employment Benefits (OPEB) healthcare obligations under Governmental Accounting Standards Board (GASB) Statement No. 75.\nPlease review the following explanation and directions below, along with the Additional Disclosures and Certification Letter before proceeding."]
[]
[null,"Requirements to use this tool"]
[null,"The following requirements must be met to use this tool:"]
[null,null,"(1) Employers must be local government entities in Washington State.  Employers outside the State of \n      Washington are not eligible to use this tool."]
[null,null,"(2) Covered members must be active in or retired from LEOFF 1.  \n     Please see the Public Employees' Benefit Board (PEBB) AMM Online Tool for reporting PEBB\n     healthcare obligations."]
{"$rows_left_out":29}
{"sheet":"GASB Results","index":1,"n_rows":55,"n_cols":8,"rows_kept":55,"cut":false,"hidden":false,"merged":[[12,2,12,3],[0,1,0,7],[2,2,2,4],[3,2,3,4],[4,2,4,3],[5,2,5,3],[6,2,6,3],[7,2,7,3],[8,2,8,3],[9,2,9,3],[10,2,10,3],[11,2,11,3],[37,4,37,5],[13,2,13,3],[14,2,14,3],[15,2,15,3],[17,2,17,4],[25,5,26,6],[27,2,27,6],[32,4,32,5],[33,4,33,5],[34,4,34,5],[35,4,35,5],[36,4,36,5],[55,1,55,7],[43,4,43,5],[38,4,38,5],[39,4,39,5],[40,4,40,5],[41,4,41,5],[42,4,42,5],[44,4,44,5],[45,4,45,5],[51,4,51,5],[53,2,53,5],[50,4,50,5],[49,4,49,5],[48,4,48,5],[47,4,47,5]]}
[null,"LEOFF 1 - GASB 75 Reporting Results and Required Disclosures"]
[]
[null,null,"Schedule of Changes in Total Other Liability and Related Ratios"]
[null,null,"Measurement Date of June 30, 2018"]
[null,null,"Total OPEB Liability (TOL)"]
[null,null,"Service Cost*",null,{"$f":"ROUND(Log!L5,0)","v":0}]
[null,null,"Interest Cost",null,{"$f":"ROUND(((E6+E13)*Lookups!L1+E10*((1+Lookups!L1)^0.5-1)),0)","v":0}]
[null,null,"Changes in Experience Data and Assumptions",null,{"$f":"E12-E6-E7-E10","v":0}]
[null,null,"Changes in Benefit Terms",null,0]
[null,null,"Estimated Benefit Payments",null,{"$f":"-ROUND(SUM(Log!G7:J7)/AVERAGE(Trends!B3:H3),0)","v":0}]
{"$rows_left_out":46}
{"sheet":"Additional Disclosures","index":2,"n_rows":46,"n_cols":4,"rows_kept":46,"cut":false,"hidden":false,"merged":[[46,1,46,3],[0,1,0,3]]}
[null,"LEOFF 1 - AMM Online Tool Additional Disclosures"]
[]
[null,null,"This tab is intended to:"]
[null,null,"(1) Provide guidance on concepts that require users to apply their judgment and/or consult with their auditor."]
[null,null,"(2) Document the assumptions and methods we employed for purposes of this AMM Online Tool that vary\n     from the underlying GASB 45 actuarial valuation we performed at the plan-level."]
[]
[null,null,"Data Inputs:"]
[]
[null,null,"We assume the inputs you provide are as of the measurement date of 6/30/2018.  If you are not able to determine the counts and average ages as of that time, utilizing your current data or as of your reporting date may be reasonable.  Please consult with your auditor for further guidance."]
[]
{"$rows_left_out":37}
{"sheet":"Certification Letter","index":3,"n_rows":117,"n_cols":4,"rows_kept":117,"cut":false,"hidden":false,"merged":[[0,1,0,3],[59,1,59,3],[60,1,60,3],[117,1,117,3]]}
[null,"GASB 75 AMM Online Tool Actuarial Certification"]
[]
[]
[]
[]
[]
[]
[]
[]
[]
{"$rows_left_out":108}
{"sheet":"Inactive","index":4,"n_rows":101,"n_cols":43,"rows_kept":101,"cut":false,"hidden":true,"merged":[[0,19,0,21],[0,9,0,10],[0,11,0,12],[0,13,0,14],[0,16,0,18]]}
["Inactives",1,null,"Medical","Medicare",null,"LTC - Inst.","LTC - Non Inst.",null,"Medical - Age<65",null,"Medical - Age>=65",null,"Medicare ",null,null,"LTC - Inst.",null,null,"LTC - Non Inst.",null,null,null,"Medical","Medicare",null,null,"LTC - Inst.","LTC - Non Inst.",null,null,null,null,null,"Pct Male",1,null,null,null,null,null,"PV of "]
["Year",null,null,"Cost","Cost",null,"Cost","Cost",null,"Trend","Rel Trend","Trend","Rel Trend","Trend","Rel Trend",null,"Rate","Trend","Rel Trend","Rate","Trend","Rel Trend",null,"Net Cost","Net Cost","Total",null,"Net Cost","Net Cost","Total",null,"Grand Total",null,"Mort - M","Mort - F","Mortality","Survive","Interest","Pay Timing",null,null,"Benefits"]
[{"$f":"ValYear","v":2018},80,null,{"$f":"VLOOKUP(B3,Lookups!A:B,2)","v":16563.61},{"$f":"VLOOKUP(B3,Lookups!A:C,3)","v":1506.57},null,{"$f":"VLOOKUP(B3,Lookups!A:D,4)","v":193012.84},{"$f":"VLOOKUP(B3,Lookups!A:E,5)","v":102315.75},null,{"$f":"VLOOKUP(A3,Trends!$A$3:$H$94,IF(ExFlg=0,4,2))+Sens","v":1.1839999999999999},1,{"$f":"VLOOKUP(A3,Trends!$A$3:$H$94,IF(ExFlg=0,5,3))+Sens","v":1.123},1,{"$f":"VLOOKUP(A3,Trends!$A$3:$H$94,6)+Sens","v":1.0565},1,null,{"$f":"IF(B3<=120,VLOOKUP(B3,Lookups!$A$3:$I$103,8,FALSE),\"\")","v":2.5000000000000001E-2},{"$f":"VLOOKUP(A3,Trends!$A$3:$H$94,7)+Sens","v":1.0449999999999999},1,{"$f":"IF(B3<=120,VLOOKUP(B3,Lookups!$A$3:$I$103,9,FALSE),\"\")","v":3.9899999999999998E-2},{"$f":"VLOOKUP(A3,Trends!$A$3:$H$94,8)+Sens","v":1.0449999999999999},1,null,{"$f":"IF(B3<=120,IF(B3<65,D3*K3,D3*M3),\"\")","v":16563.61},{"$f":"IF(B3<=120,E3*O3,\"\")","v":1506.57},{"$f":"IF(B3<=120,X3+Y3,\"\")","v":18070.18},null,{"$f":"IF(B3<=120,G3*Q3*S3,\"\")","v":4825.3209999999999},{"$f":"IF(B3<=120,H3*T3*V3,\"\")","v":4082.3984249999999},{"$f":"IF(B3<=120,AB3+AC3,\"\")","v":8907.7194249999993},null,{"$f":"IF(B3<=120,Z3+AD3, \"\")","v":26977.899425},null,{"$f":"IF($B3<121,VLOOKUP($B3,Lookups!A:F,6)*(1-VLOOKUP($B3,Lookups!$N$3:$P$103,2))^($A3-$A$3),\"\")","v":5.2723000000000006E-2},{"$f":"IF($B3<121,VLOOKUP($B3,Lookups!A:G,7)*(1-VLOOKUP($B3,Lookups!$N$3:$P$103,3))^($A3-$A$3),\"\")","v":4.3080500000000001E-2},{"$f":"IF(B3<121,(PCTMALE*AH3+(1-PCTMALE)*AI3),\"\")","v":5.2723000000000006E-2},1,1,{"$f":"IF(AJ3=\"\",\"\",ROUND((13/24)+(11/24)*(1/(1+IntRt))*(1-AJ3),6))","v":0.96082900000000004},null,null,{"$f":"IF(B3<=120,AF3*AK3*AL3*AM3,\"\")","v":25921.148126623324}]
[{"$f":"1+A3","v":2019},{"$f":"1+B3","v":81},null,{"$f":"VLOOKUP(B4,Lookups!A:B,2)","v":16591.66},{"$f":"VLOOKUP(B4,Lookups!A:C,3)","v":1506.57},null,{"$f":"VLOOKUP(B4,Lookups!A:D,4)","v":194000.12},{"$f":"VLOOKUP(B4,Lookups!A:E,5)","v":102315.75},null,{"$f":"VLOOKUP(A4,Trends!$A$3:$H$94,IF(ExFlg=0,4,2))+Sens","v":1.161},{"$f":"K3*J3","v":1.1839999999999999},{"$f":"VLOOKUP(A4,Trends!$A$3:$H$94,IF(ExFlg=0,5,3))+Sens","v":1.111},{"$f":"M3*L3","v":1.123},{"$f":"VLOOKUP(A4,Trends!$A$3:$H$94,6)+Sens","v":1.0569999999999999},{"$f":"O3*N3","v":1.0565},null,{"$f":"IF(B4<=120,VLOOKUP(B4,Lookups!$A$3:$I$103,8,FALSE),\"\")","v":2.8400000000000002E-2},{"$f":"VLOOKUP(A4,Trends!$A$3:$H$94,7)+Sens","v":1.0449999999999999},{"$f":"S3*R3","v":1.0449999999999999},{"$f":"IF(B4<=120,VLOOKUP(B4,Lookups!$A$3:$I$103,9,FALSE),\"\")","v":4.2999999999999997E-2},{"$f":"VLOOKUP(A4,Trends!$A$3:$H$94,8)+Sens","v":1.0449999999999999},{"$f":"V3*U3","v":1.0449999999999999},null,{"$f":"IF(B4<=120,IF(B4<65,D4*K4,D4*M4),\"\")","v":18632.43418},{"$f":"IF(B4<=120,E4*O4,\"\")","v":1591.6912049999999},{"$f":"IF(B4<=120,X4+Y4,\"\")","v":20224.125384999999},null,{"$f":"IF(B4<=120,G4*Q4*S4,\"\")","v":5757.5355613599995},{"$f":"IF(B4<=120,H4*T4*V4,\"\")","v":4597.5582262499993},{"$f":"IF(B4<=120,AB4+AC4,\"\")","v":10355.09378761},null,{"$f":"IF(B4<=120,Z4+AD4, \"\")","v":30579.219172609999},null,{"$f":"IF($B4<121,VLOOKUP($B4,Lookups!A:F,6)*(1-VLOOKUP($B4,Lookups!$N$3:$P$103,2))^($A4-$A$3),\"\")","v":5.7812604999999996E-2},{"$f":"IF($B4<121,VLOOKUP($B4,Lookups!A:G,7)*(1-VLOOKUP($B4,Lookups!$N$3:$P$103,3))^($A4-$A$3),\"\")","v":4.7224917999999998E-2},{"$f":"IF(B4<121,(PCTMALE*AH4+(1-PCTMALE)*AI4),\"\")","v":5.7812604999999996E-2},{"$f":"IF(B4<121,AK3*(1-AJ3),\"\")","v":0.94727700000000004},{"$f":"IF(B4<121,AL3/(1+IntRt),\"\")","v":0.9654373431164317},{"$f":"IF(AJ4=\"\",\"\",ROUND((13/24)+(11/24)*(1/(1+IntRt))*(1-AJ4),6))","v":0.95857700000000001},null,null,{"$f":"IF(B4<=120,AF4*AK4*AL4*AM4,\"\")","v":26807.386881610677}]
[2020,82,null,{"$f":"VLOOKUP(B5,Lookups!A:B,2)","v":16619.72},{"$f":"VLOOKUP(B5,Lookups!A:C,3)","v":1506.57},null,{"$f":"VLOOKUP(B5,Lookups!A:D,4)","v":194987.4},{"$f":"VLOOKUP(B5,Lookups!A:E,5)","v":102315.75},null,{"$f":"VLOOKUP(A5,Trends!$A$3:$H$94,IF(ExFlg=0,4,2))+Sens","v":1.0569999999999999},{"$f":"K4*J4","v":1.3746240000000001},{"$f":"VLOOKUP(A5,Trends!$A$3:$H$94,IF(ExFlg=0,5,3))+Sens","v":1.06},{"$f":"M4*L4","v":1.2476529999999999},{"$f":"VLOOKUP(A5,Trends!$A$3:$H$94,6)+Sens","v":1.0569999999999999},{"$f":"O4*N4","v":1.1167205},null,{"$f":"IF(B5<=120,VLOOKUP(B5,Lookups!$A$3:$I$103,8,FALSE),\"\")","v":3.1800000000000002E-2},{"$f":"VLOOKUP(A5,Trends!$A$3:$H$94,7)+Sens","v":1.0449999999999999},{"$f":"S4*R4","v":1.0920249999999998},{"$f":"IF(B5<=120,VLOOKUP(B5,Lookups!$A$3:$I$103,9,FALSE),\"\")","v":4.6199999999999998E-2},{"$f":"VLOOKUP(A5,Trends!$A$3:$H$94,8)+Sens","v":1.0449999999999999},{"$f":"V4*U4","v":1.0920249999999998},null,20735.643517159999,1682.4176036849999,22418.061120844999,null,6771.2094724229992,5161.9886884912494,11933.198160914249,null,34351.259281759252,null,{"$f":"IF($B5<121,VLOOKUP($B5,Lookups!A:F,6)*(1-VLOOKUP($B5,Lookups!$N$3:$P$103,2))^($A5-$A$3),\"\")","v":6.3499285799999999E-2},{"$f":"IF($B5<121,VLOOKUP($B5,Lookups!A:G,7)*(1-VLOOKUP($B5,Lookups!$N$3:$P$103,3))^($A5-$A$3),\"\")","v":5.1851305064E-2},6.3499285799999999E-2,{"$f":"IF(B5<121,AK4*(1-AJ4),\"\")","v":0.89251244897341508},0.93206926348371466,0.95606100000000005,null,null,27320.631540810205]
[2021,83,null,{"$f":"VLOOKUP(B6,Lookups!A:B,2)","v":16556.91},{"$f":"VLOOKUP(B6,Lookups!A:C,3)","v":1506.57},null,{"$f":"VLOOKUP(B6,Lookups!A:D,4)","v":195316.49},{"$f":"VLOOKUP(B6,Lookups!A:E,5)","v":101753.58},null,{"$f":"VLOOKUP(A6,Trends!$A$3:$H$94,IF(ExFlg=0,4,2))+Sens","v":1.0569999999999999},{"$f":"K5*J5","v":1.4529775679999999},{"$f":"VLOOKUP(A6,Trends!$A$3:$H$94,IF(ExFlg=0,5,3))+Sens","v":1.06},1.3225121799999999,{"$f":"VLOOKUP(A6,Trends!$A$3:$H$94,6)+Sens","v":1.0585},1.1803735684999999,null,{"$f":"IF(B6<=120,VLOOKUP(B6,Lookups!$A$3:$I$103,8,FALSE),\"\")","v":3.78E-2},{"$f":"VLOOKUP(A6,Trends!$A$3:$H$94,7)+Sens","v":1.0449999999999999},1.1411661249999998,{"$f":"IF(B6<=120,VLOOKUP(B6,Lookups!$A$3:$I$103,9,FALSE),\"\")","v":5.1299999999999998E-2},{"$f":"VLOOKUP(A6,Trends!$A$3:$H$94,8)+Sens","v":1.0449999999999999},1.1411661249999998,null,21896.7151381638,1778.3154070950447,23675.030545258844,null,8425.1876451838652,5956.8399898453945,14382.027635029259,null,38057.058180288106,null,{"$f":"IF($B6<121,VLOOKUP($B6,Lookups!A:F,6)*(1-VLOOKUP($B6,Lookups!$N$3:$P$103,2))^($A6-$A$3),\"\")","v":6.96173330305625E-2},{"$f":"IF($B6<121,VLOOKUP($B6,Lookups!A:G,7)*(1-VLOOKUP($B6,Lookups!$N$3:$P$103,3))^($A6-$A$3),\"\")","v":5.7026279768223997E-2},6.96173330305625E-2,0.83583854589599427,0.89985447333820678,0.95335400000000003,null,null,27288.777644299189]
[2022,84,null,{"$f":"VLOOKUP(B7,Lookups!A:B,2)","v":16494.52},{"$f":"VLOOKUP(B7,Lookups!A:C,3)","v":1506.57},null,{"$f":"VLOOKUP(B7,Lookups!A:D,4)","v":195645.58},{"$f":"VLOOKUP(B7,Lookups!A:E,5)","v":101191.4},null,{"$f":"VLOOKUP(A7,Trends!$A$3:$H$94,IF(ExFlg=0,4,2))+Sens","v":1.0569999999999999},1.5357972893759997,{"$f":"VLOOKUP(A7,Trends!$A$3:$H$94,IF(ExFlg=0,5,3))+Sens","v":1.06},1.4018629108,{"$f":"VLOOKUP(A7,Trends!$A$3:$H$94,6)+Sens","v":1.0585},{"$f":"O6*N6","v":1.2494254222572498},null,{"$f":"IF(B7<=120,VLOOKUP(B7,Lookups!$A$3:$I$103,8,FALSE),\"\")","v":4.3799999999999999E-2},{"$f":"VLOOKUP(A7,Trends!$A$3:$H$94,7)+Sens","v":1.0449999999999999},1.1925186006249997,{"$f":"IF(B7<=120,VLOOKUP(B7,Lookups!$A$3:$I$103,9,FALSE),\"\")","v":5.6500000000000002E-2},{"$f":"VLOOKUP(A7,Trends!$A$3:$H$94,8)+Sens","v":1.0449999999999999},1.1925186006249997,null,23123.055819448819,1882.3468584101049,25005.402677858925,null,10219.021505666908,6818.0034098655788,17037.024915532485,null,42042.42759339141,null,{"$f":"IF($B7<121,VLOOKUP($B7,Lookups!A:F,6)*(1-VLOOKUP($B7,Lookups!$N$3:$P$103,2))^($A7-$A$3),\"\")","v":7.6200252436543117E-2},{"$f":"IF($B7<121,VLOOKUP($B7,Lookups!A:G,7)*(1-VLOOKUP($B7,Lookups!$N$3:$P$103,3))^($A7-$A$3),\"\")","v":6.2805194179561596E-2},7.6200252436543117E-2,0.7776496954865717,0.8687531119310743,0.95044099999999998,null,null,26995.621292793712]
[2023,85,null,{"$f":"VLOOKUP(B8,Lookups!A:B,2)","v":16432.27},{"$f":"VLOOKUP(B8,Lookups!A:C,3)","v":1506.57},null,{"$f":"VLOOKUP(B8,Lookups!A:D,4)","v":195974.68},{"$f":"VLOOKUP(B8,Lookups!A:E,5)","v":100629.23},null,{"$f":"VLOOKUP(A8,Trends!$A$3:$H$94,IF(ExFlg=0,4,2))+Sens","v":1.0580000000000001},1.6233377348704316,{"$f":"VLOOKUP(A8,Trends!$A$3:$H$94,IF(ExFlg=0,5,3))+Sens","v":1.0609999999999999},1.485974685448,{"$f":"VLOOKUP(A8,Trends!$A$3:$H$94,6)+Sens","v":1.0585},1.3225168094592989,null,{"$f":"IF(B8<=120,VLOOKUP(B8,Lookups!$A$3:$I$103,8,FALSE),\"\")","v":4.99E-2},{"$f":"VLOOKUP(A8,Trends!$A$3:$H$94,7)+Sens","v":1.0449999999999999},1.2461819376531247,{"$f":"IF(B8<=120,VLOOKUP(B8,Lookups!$A$3:$I$103,9,FALSE),\"\")","v":6.1600000000000002E-2},{"$f":"VLOOKUP(A8,Trends!$A$3:$H$94,8)+Sens","v":1.0449999999999999},1.2461819376531247,null,24417.93724444661,1992.4641496270958,26410.401394073706,null,12186.583312022218,7724.7834556780235,19911.366767700241,null,46321.768161773944,null,{"$f":"IF($B8<121,VLOOKUP($B8,Lookups!A:F,6)*(1-VLOOKUP($B8,Lookups!$N$3:$P$103,2))^($A8-$A$3),\"\")","v":8.3289076757996988E-2},{"$f":"IF($B8<121,VLOOKUP($B8,Lookups!A:G,7)*(1-VLOOKUP($B8,Lookups!$N$3:$P$103,3))^($A8-$A$3),\"\")","v":6.9206816018895445E-2},8.3289076757996988E-2,0.718392592383294,0.83872669620686835,0.94730400000000003,null,null,26439.717579056025]
[2024,86,null,{"$f":"VLOOKUP(B9,Lookups!A:B,2)","v":16370.29},{"$f":"VLOOKUP(B9,Lookups!A:C,3)","v":1506.57},null,{"$f":"VLOOKUP(B9,Lookups!A:D,4)","v":196303.77},{"$f":"VLOOKUP(B9,Lookups!A:E,5)","v":100067.06},null,{"$f":"VLOOKUP(A9,Trends!$A$3:$H$94,IF(ExFlg=0,4,2))+Sens","v":1.0589999999999999},1.7174913234929168,{"$f":"VLOOKUP(A9,Trends!$A$3:$H$94,IF(ExFlg=0,5,3))+Sens","v":1.0609999999999999},1.5766191412603279,{"$f":"VLOOKUP(A9,Trends!$A$3:$H$94,6)+Sens","v":1.0585},1.399884042812668,null,{"$f":"IF(B9<=120,VLOOKUP(B9,Lookups!$A$3:$I$103,8,FALSE),\"\")","v":5.5899999999999998E-2},{"$f":"VLOOKUP(A9,Trends!$A$3:$H$94,7)+Sens","v":1.0449999999999999},1.3022601248475152,{"$f":"IF(B9<=120,VLOOKUP(B9,Lookups!$A$3:$I$103,9,FALSE),\"\")","v":6.6799999999999998E-2},{"$f":"VLOOKUP(A9,Trends!$A$3:$H$94,8)+Sens","v":1.0449999999999999},1.3022601248475152,null,25809.712561982535,2109.0233023802812,27918.735864362818,null,14290.196176378498,8704.9312488547494,22995.127425233248,null,50913.863289596062,null,{"$f":"IF($B9<121,VLOOKUP($B9,Lookups!A:F,6)*(1-VLOOKUP($B9,Lookups!$N$3:$P$103,2))^($A9-$A$3),\"\")","v":9.0919380114213091E-2},{"$f":"IF($B9<121,VLOOKUP($B9,Lookups!A:G,7)*(1-VLOOKUP($B9,Lookups!$N$3:$P$103,3))^($A9-$A$3),\"\")","v":7.6207993037879673E-2},9.0919380114213091E-2,0.65855833661390539,0.80973807318678148,0.94392799999999999,null,null,25627.942014118198]
[2025,87,null,{"$f":"VLOOKUP(B10,Lookups!A:B,2)","v":16308.46},{"$f":"VLOOKUP(B10,Lookups!A:C,3)","v":1506.57},null,{"$f":"VLOOKUP(B10,Lookups!A:D,4)","v":196632.86},{"$f":"VLOOKUP(B10,Lookups!A:E,5)","v":99504.88},null,{"$f":"VLOOKUP(A10,Trends!$A$3:$H$94,IF(ExFlg=0,4,2))+Sens","v":1.0589999999999999},1.8188233115789987,{"$f":"VLOOKUP(A10,Trends!$A$3:$H$94,IF(ExFlg=0,5,3))+Sens","v":1.0620000000000001},1.6727929088772078,{"$f":"VLOOKUP(A10,Trends!$A$3:$H$94,6)+Sens","v":1.0585},1.4817772593172092,null,{"$f":"IF(B10<=120,VLOOKUP(B10,Lookups!$A$3:$I$103,8,FALSE),\"\")","v":6.1899999999999997E-2},{"$f":"VLOOKUP(A10,Trends!$A$3:$H$94,7)+Sens","v":1.0449999999999999},1.3608618304656532,{"$f":"IF(B10<=120,VLOOKUP(B10,Lookups!$A$3:$I$103,9,FALSE),\"\")","v":7.1900000000000006E-2},{"$f":"VLOOKUP(A10,Trends!$A$3:$H$94,8)+Sens","v":1.0449999999999999},1.3608618304656532,null,27280.676242707588,2232.4011655695276,29513.077408277117,null,16563.830519557454,9736.1510665549868,26299.981586112441,null,55813.058994389561,null,{"$f":"IF($B10<121,VLOOKUP($B10,Lookups!A:F,6)*(1-VLOOKUP($B10,Lookups!$N$3:$P$103,2))^($A10-$A$3),\"\")","v":0.10165241803578633},{"$f":"IF($B10<121,VLOOKUP($B10,Lookups!A:G,7)*(1-VLOOKUP($B10,Lookups!$N$3:$P$103,3))^($A10-$A$3),\"\")","v":8.3729588849723618E-2},0.10165241803578633,0.59868262087992186,0.78175137399766503,0.93917799999999996,null,null,24532.908618476944]
{"$rows_left_out":92}
{"sheet":"Log","index":5,"n_rows":32,"n_cols":12,"rows_kept":32,"cut":false,"hidden":true,"merged":[[0,1,0,4],[0,6,0,9]]}
["EoP = End of Period","Actives Cohort",null,null,null,null,"Inactive Cohorts"]
["BoP = Beginning of Period","1","2","3","4",null,"1","2","3","4"]
[null,null,null,null,null,null,"55-64","65-69","70-74","75+",null,"Total"]
["Run 1 - EoP Data, BoP Discount Rate, New HC Assumptions"]
["Service Cost (EANC)",null,null,null,null,null,null,null,null,null,null,{"$f":"SUM(B5:E5)","v":0}]
["Total OPEB Liability (TOL)",null,null,null,null,null,0,0,0,0,null,{"$f":"SUM(B6:E6,G6:J6)","v":0}]
["Expected Benefit Payments ",null,null,null,null,null,0,0,0,0,null,{"$f":"SUM(B7:E7,G7:J7)","v":0}]
[]
["Run 2 - EoP Data, EoP Discount Rate, New HC Assumptions"]
["Service Cost (EANC)",null,null,null,null,null,null,null,null,null,null,{"$f":"SUM(B10:E10)","v":0}]
{"$rows_left_out":23}
{"sheet":"Lookups","index":6,"n_rows":103,"n_cols":18,"rows_kept":103,"cut":false,"hidden":true,"merged":[[0,7,1,7],[0,8,1,8],[0,14,0,15]]}
[null,"Medical","Medicare ","LTC Inst.","LTC Non-","Mortality","Mortality","Institutional\nLTC Rate","Non-Inst.\nLTC Rate",null,"2017 Discount",3.5799999999999998E-2,null,null,"100% Scale BB"]
["Age","Cost","Cost","Cost","Inst. Cost","Male","Female",null,null,null,"2018 Discount",3.8699999999999998E-2,null,"Age","Male","Female"]
[20,18101.189999999999,0,194164.67,112434.89,3.3049999999999996E-4,1.83E-4,4.0000000000000002E-4,2.2000000000000001E-3,null,null,null,null,20,3.0000000000000001E-3,3.0000000000000001E-3,null,"Sources"]
[{"$f":"1+A3","v":21},18101.189999999999,0,194164.67,112434.89,3.4000000000000002E-4,1.8550000000000001E-4,4.0000000000000002E-4,2.2000000000000001E-3,null,null,"Int Rt",null,21,3.0000000000000001E-3,3.0000000000000001E-3,null,"Premiums/Costs/Trends"]
[22,18101.189999999999,0,194164.67,112434.89,3.4699999999999998E-4,1.885E-4,4.0000000000000002E-4,2.2000000000000001E-3,null,null,3.5799999999999998E-2,null,22,3.0000000000000001E-3,3.0000000000000001E-3,null,"Mortality"]
[23,18101.189999999999,0,194164.67,112434.89,3.5149999999999998E-4,1.93E-4,4.0000000000000002E-4,2.2000000000000001E-3,null,null,null,null,23,3.0000000000000001E-3,3.0000000000000001E-3]
[24,18101.189999999999,0,194164.67,112434.89,3.5550000000000002E-4,1.995E-4,4.0000000000000002E-4,2.2000000000000001E-3,null,null,"Sens",null,24,3.0000000000000001E-3,3.0000000000000001E-3]
[25,18101.189999999999,0,194164.67,112434.89,3.59E-4,2.0699999999999999E-4,4.0000000000000002E-4,2.2000000000000001E-3,null,null,0,null,25,3.0000000000000001E-3,3.0000000000000001E-3]
[26,18101.189999999999,0,194164.67,112434.89,3.6399999999999996E-4,2.1700000000000002E-4,4.0000000000000002E-4,2.2000000000000001E-3,null,null,null,null,26,3.0000000000000001E-3,3.0000000000000001E-3]
[27,18101.189999999999,0,194164.67,112434.89,3.7399999999999998E-4,2.2899999999999998E-4,4.0000000000000002E-4,2.2000000000000001E-3,null,null,"ExFlg",null,27,3.0000000000000001E-3,3.0000000000000001E-3]
{"$rows_left_out":94}
{"sheet":"Trends","index":7,"n_rows":94,"n_cols":8,"rows_kept":94,"cut":false,"hidden":true,"merged":[[0,1,0,7]]}
["Beginning of ","Costs Trends"]
["Year","Medical \nExcise Tax - Age<65","Medical \nExcise Tax - Age>=65","Medical \nNo Excise Tax - Age<65","Medical \n No Excise Tax - Age>=65","Medicare Part B","LTC Inst.","LTC Non-Inst."]
[2018,1.1839999999999999,1.123,1.0620000000000001,1.0660000000000001,1.0565,1.0449999999999999,1.0449999999999999]
[{"$f":"1+A3","v":2019},1.161,1.111,1.056,1.0569999999999999,1.0569999999999999,1.0449999999999999,1.0449999999999999]
[2020,1.0569999999999999,1.06,1.0529999999999999,1.054,1.0569999999999999,1.0449999999999999,1.0449999999999999]
[2021,1.0569999999999999,1.06,1.054,1.054,1.0585,1.0449999999999999,1.0449999999999999]
[2022,1.0569999999999999,1.06,1.054,1.054,1.0585,1.0449999999999999,1.0449999999999999]
[2023,1.0580000000000001,1.0609999999999999,1.0549999999999999,1.0549999999999999,1.0585,1.0449999999999999,1.0449999999999999]
[2024,1.0589999999999999,1.0609999999999999,1.0549999999999999,1.0549999999999999,1.0585,1.0449999999999999,1.0449999999999999]
[2025,1.0589999999999999,1.0620000000000001,1.056,1.056,1.0585,1.0449999999999999,1.0449999999999999]
{"$rows_left_out":84}